﻿"Item Id","Item URI","Dublin Core:Alternative Title","Dublin Core:Abstract","Dublin Core:Table Of Contents","Dublin Core:Date Available","Dublin Core:Date Created","Dublin Core:Date Accepted","Dublin Core:Date Copyrighted","Dublin Core:Date Submitted","Dublin Core:Date Issued","Dublin Core:Date Modified","Dublin Core:Date Valid","Dublin Core:Access Rights","Dublin Core:License","Dublin Core:Conforms To","Dublin Core:Has Format","Dublin Core:Has Part","Dublin Core:Has Version","Dublin Core:Is Format Of","Dublin Core:Is Part Of","Dublin Core:Is Referenced By","Dublin Core:Is Replaced By","Dublin Core:Is Required By","Dublin Core:Is Version Of","Dublin Core:References","Dublin Core:Replaces","Dublin Core:Requires","Dublin Core:Extent","Dublin Core:Medium","Dublin Core:Bibliographic Citation","Dublin Core:Spatial Coverage","Dublin Core:Temporal Coverage","Dublin Core:Accrual Method","Dublin Core:Accrual Periodicity","Dublin Core:Accrual Policy","Dublin Core:Audience","Dublin Core:Audience Education Level","Dublin Core:Mediator","Dublin Core:Instructional Method","Dublin Core:Provenance","Dublin Core:Rights Holder","Dublin Core:Title","Dublin Core:Subject","Dublin Core:Description","Dublin Core:Creator","Dublin Core:Source","Dublin Core:Publisher","Dublin Core:Date","Dublin Core:Contributor","Dublin Core:Rights","Dublin Core:Relation","Dublin Core:Format","Dublin Core:Language","Dublin Core:Type","Dublin Core:Identifier","Dublin Core:Coverage","Item Type Metadata:Text","Item Type Metadata:Interviewer","Item Type Metadata:Interviewee","Item Type Metadata:Location","Item Type Metadata:Transcription","Item Type Metadata:Local URL","Item Type Metadata:Original Format","Item Type Metadata:Physical Dimensions","Item Type Metadata:Duration","Item Type Metadata:Compression","Item Type Metadata:Producer","Item Type Metadata:Director","Item Type Metadata:Bit Rate/Frequency","Item Type Metadata:Time Summary","Item Type Metadata:Email Body","Item Type Metadata:Subject Line","Item Type Metadata:From","Item Type Metadata:To","Item Type Metadata:CC","Item Type Metadata:BCC","Item Type Metadata:Number of Attachments","Item Type Metadata:Standards","Item Type Metadata:Objectives","Item Type Metadata:Materials","Item Type Metadata:Lesson Plan Text","Item Type Metadata:URL","Item Type Metadata:Event Type","Item Type Metadata:Participants","Item Type Metadata:Birth Date","Item Type Metadata:Birthplace","Item Type Metadata:Death Date","Item Type Metadata:Occupation","Item Type Metadata:Biographical Text","Item Type Metadata:Bibliography","Item Type Metadata:Player","Item Type Metadata:Episode","Item Type Metadata:Season","Item Type Metadata:Episode Type","Item Type Metadata:Explicit","Item Type Metadata:Block","PDF Text:Text",tags,file,itemType,collection,public,featured
2824,https://omeka.lib.jmu.edu/erp/items/show/2824,,,,,,,,,,,,,,,,,,,,,,,,,,,,,,,,,,,,,,,,,"Commonwealth v. Selden Lam","Misdemeanor^^guilty^^State Normal Chem Analysis^^manufacture^^sell","Misdemeanor; Guilty",,"Rockingham County Circuit Court ","JMU Libraries",1921,"Craig Schaefer, Kayla Heslin, Selena St. Andre","This work has been identified as being free of known restrictions under copyright law, including all related and neighboring rights. (<a href=""https://creativecommons.org/publicdomain/mark/1.0/"" target=""_blank"" rel=""noreferrer noopener"">https://creativecommons.org/publicdomain/mark/1.0/</a>)",,"PDF ",,,RcPr-box2-005,,,,,,,,,,,,,,,,,,,,,,,,,,,,,,,,,,,,,,,,,,,Lam,https://omeka.lib.jmu.edu/erp/files/original/d8425c4817727987d3ae55a93afe7181.pdf,Text,"Rockingham County Prohibition Records: Criminal Cases",1,0
2751,https://omeka.lib.jmu.edu/erp/items/show/2751,,,,,,,,,,,,,,,,,,,,,,,,,,,,,,,,,,,,,,,,,"Commonwealth v. Scott H. Barber","misdemeanor^^guilty^^Received whiskey from Southern Express Company","Misdemeanor; Guilty",,"Rockingham County Circuit Court ","JMU Libraries",1917,"Craig Schaefer, Kayla Heslin, Selena St. Andre","This work has been identified as being free of known restrictions under copyright law, including all related and neighboring rights. (<a href=""https://creativecommons.org/publicdomain/mark/1.0/"" target=""_blank"" rel=""noreferrer noopener"">https://creativecommons.org/publicdomain/mark/1.0/</a>)",,"PDF ",,,RcPr-box1-012,,,,,,,,,,,,,,,,,,,,,,,,,,,,,,,,,,,,,,,,,,,Barber,https://omeka.lib.jmu.edu/erp/files/original/d09f58e1b36eb2e4e96211bf5a969a60.pdf,Text,"Rockingham County Prohibition Records: Criminal Cases",1,0
2941,https://omeka.lib.jmu.edu/erp/items/show/2941,,,,,,,,,,,,,,,,,,,,,,,,,,,,,,,,,,,,,,,,,"Commonwealth v. Saylor Crist and William Hinegardner","Misdemeanor^^Indictment^^Ford Touring Car^^Federal agent","Misdemeanor; Indictment",,"Rockingham County Circuit Court ","JMU Libraries",1924,"Craig Schaefer, Kayla Heslin, Selena St. Andre","This work has been identified as being free of known restrictions under copyright law, including all related and neighboring rights. (<a href=""https://creativecommons.org/publicdomain/mark/1.0/"" target=""_blank"" rel=""noreferrer noopener"">https://creativecommons.org/publicdomain/mark/1.0/</a>)",,PDF,,,RcPr-box4-002,,,,,,,,,,,,,,,,,,,,,,,,,,,,,,,,,,,,,,,,,,,"Crist,Hinegardner",https://omeka.lib.jmu.edu/erp/files/original/b2ce10df022fdab182fc603c9de93803.pdf,Text,"Rockingham County Prohibition Records: Criminal Cases",1,0
2925,https://omeka.lib.jmu.edu/erp/items/show/2925,,,,,,,,,,,,,,,,,,,,,,,,,,,,,,,,,,,,,,,,,"Commonwealth v. Sarah M. Snyder",Misdemeanor^^Indictment,"Misdemeanor; Indictment",,"Rockingham County Circuit Court ","JMU Libraries",1923,"Craig Schaefer, Kayla Heslin, Selena St. Andre","This work has been identified as being free of known restrictions under copyright law, including all related and neighboring rights. (<a href=""https://creativecommons.org/publicdomain/mark/1.0/"" target=""_blank"" rel=""noreferrer noopener"">https://creativecommons.org/publicdomain/mark/1.0/</a>)",,PDF,,,RcPr-box3-049,,,,,,,,,,,,,,,,,,,,,,,,,,,,,,,,,,,,,,,,,,,Snyder,https://omeka.lib.jmu.edu/erp/files/original/08a167100cdb553c95eb37069a5406ea.pdf,Text,"Rockingham County Prohibition Records: Criminal Cases",1,0
2778,https://omeka.lib.jmu.edu/erp/items/show/2778,,,,,,,,,,,,,,,,,,,,,,,,,,,,,,,,,,,,,,,,,"Commonwealth v. Sarah Holloway",,,,"Rockingham County Circuit Court ","JMU Libraries",1918,"Craig Schaefer, Kayla Heslin, Selena St. Andre","This work has been identified as being free of known restrictions under copyright law, including all related and neighboring rights. (<a href=""https://creativecommons.org/publicdomain/mark/1.0/"" target=""_blank"" rel=""noreferrer noopener"">https://creativecommons.org/publicdomain/mark/1.0/</a>)",,"PDF ",,,RcPr-box1-039,,,,,,,,,,,,,,,,,,,,,,,,,,,,,,,,,,,,,,,,,,,Holloway,https://omeka.lib.jmu.edu/erp/files/original/dc1e7eac7949c8bfac8c554842cf8257.pdf,Text,"Rockingham County Prohibition Records: Criminal Cases",1,0
2913,https://omeka.lib.jmu.edu/erp/items/show/2913,,,,,,,,,,,,,,,,,,,,,,,,,,,,,,,,,,,,,,,,,"Commonwealth v. Samuel Rosson","Misdemeanor^^guilty^^witness testimony^^posession of still","Misdemeanor; Guilty",,"Rockingham County Circuit Court ","JMU Libraries",1923,"Craig Schaefer, Kayla Heslin, Selena St. Andre","This work has been identified as being free of known restrictions under copyright law, including all related and neighboring rights. (<a href=""https://creativecommons.org/publicdomain/mark/1.0/"" target=""_blank"" rel=""noreferrer noopener"">https://creativecommons.org/publicdomain/mark/1.0/</a>)",,PDF,,,RcPr-box3-037,,,,,,,,,,,,,,,,,,,,,,,,,,,,,,,,,,,,,,,,,,,"Gooden,Rosson",https://omeka.lib.jmu.edu/erp/files/original/aa10fa0374083787f2572b3503136d38.pdf,Text,"Rockingham County Prohibition Records: Criminal Cases",1,0
3078,https://omeka.lib.jmu.edu/erp/items/show/3078,,,,,,,,,,,,,,,,,,,,,,,,,,,,,,,,,,,,,,,,,"Commonwealth v. Samuel E. Davis","Felony^^Indictment^^operating a still","Felony; Indictment",,"Rockingham County Circuit Court ","JMU Libraries",1927,"Craig Schaefer, Kayla Heslin, Selena St. Andre","This work has been identified as being free of known restrictions under copyright law, including all related and neighboring rights. (<a href=""https://creativecommons.org/publicdomain/mark/1.0/"" target=""_blank"" rel=""noreferrer noopener"">https://creativecommons.org/publicdomain/mark/1.0/</a>)",,"PDF ",,,RcPr-box6-024,,,,,,,,,,,,,,,,,,,,,,,,,,,,,,,,,,,,,,,,,,,Davis,https://omeka.lib.jmu.edu/erp/files/original/cb8085212137d785745649a01e3830b5.pdf,Text,"Rockingham County Prohibition Records: Criminal Cases",1,0
3358,https://omeka.lib.jmu.edu/erp/items/show/3358,,,,,,,,,,,,,,,,,,,,,,,,,,,,,,,,,,,,,,,,,"Commonwealth v. Sam Rosson","Misdemeanor^^not guilty^^posession of ardent spirits","Misdemeanor; Not Guilty",,"Rockingham County Circuit Court ","JMU Libraries",1932,"Craig Schaefer, Kayla Heslin, Selena St. Andre","This work has been identified as being free of known restrictions under copyright law, including all related and neighboring rights. (<a href=""https://creativecommons.org/publicdomain/mark/1.0/"" target=""_blank"" rel=""noreferrer noopener"">https://creativecommons.org/publicdomain/mark/1.0/</a>)",,"PDF ",,,RcPr-box10-012,,,,,,,,,,,,,,,,,,,,,,,,,,,,,,,,,,,,,,,,,,,Rosson,https://omeka.lib.jmu.edu/erp/files/original/fbb441e73516ac493132c35a717c6b06.pdf,Text,"Rockingham County Prohibition Records: Criminal Cases",1,0
2818,https://omeka.lib.jmu.edu/erp/items/show/2818,,,,,,,,,,,,,,,,,,,,,,,,,,,,,,,,,,,,,,,,,"Commonwealth v. S.S. Snarr",,,,"Rockingham County Circuit Court ","JMU Libraries",1921,"Craig Schaefer, Kayla Heslin, Selena St. Andre","This work has been identified as being free of known restrictions under copyright law, including all related and neighboring rights. (<a href=""https://creativecommons.org/publicdomain/mark/1.0/"" target=""_blank"" rel=""noreferrer noopener"">https://creativecommons.org/publicdomain/mark/1.0/</a>)",,"PDF ",,,RcPr-box1-079,,,,,,,,,,,,,,,,,,,,,,,,,,,,,,,,,,,,,,,,,,,Snarr,https://omeka.lib.jmu.edu/erp/files/original/d7e2c5a2ca69494274e1fe6fa1032114.pdf,Text,"Rockingham County Prohibition Records: Criminal Cases",1,0
2787,https://omeka.lib.jmu.edu/erp/items/show/2787,,,,,,,,,,,,,,,,,,,,,,,,,,,,,,,,,,,,,,,,,"Commonwealth v. S.R. Andes",,,,"Rockingham County Circuit Court ","JMU Libraries",1919,"Craig Schaefer, Kayla Heslin, Selena St. Andre","This work has been identified as being free of known restrictions under copyright law, including all related and neighboring rights. (<a href=""https://creativecommons.org/publicdomain/mark/1.0/"" target=""_blank"" rel=""noreferrer noopener"">https://creativecommons.org/publicdomain/mark/1.0/</a>)",,"PDF ",,,RcPr-box1-048,,,,,,,,,,,,,,,,,,,,,,,,,,,,,,,,,,,,,,,,,,,Andes,https://omeka.lib.jmu.edu/erp/files/original/434316f435125d12c6ca754f3ecdd59e.pdf,Text,"Rockingham County Prohibition Records: Criminal Cases",1,0
2999,https://omeka.lib.jmu.edu/erp/items/show/2999,,,,,,,,,,,,,,,,,,,,,,,,,,,,,,,,,,,,,,,,,"Commonwealth v. S.M. Brown and Mark Steele",Misdemeanor^^Indictment,"Misdemeanor; Indictment",,"Rockingham County Circuit Court ","JMU Libraries",1925,"Craig Schaefer, Kayla Heslin, Selena St. Andre","This work has been identified as being free of known restrictions under copyright law, including all related and neighboring rights. (<a href=""https://creativecommons.org/publicdomain/mark/1.0/"" target=""_blank"" rel=""noreferrer noopener"">https://creativecommons.org/publicdomain/mark/1.0/</a>)",,"PDF ",,,RcPr-box5-001,,,,,,,,,,,,,,,,,,,,,,,,,,,,,,,,,,,,,,,,,,,"Brown,Steele",https://omeka.lib.jmu.edu/erp/files/original/0bc78fcb2e82eb0101e37a77a93990a6.pdf,Text,"Rockingham County Prohibition Records: Criminal Cases",1,0
2935,https://omeka.lib.jmu.edu/erp/items/show/2935,,,,,,,,,,,,,,,,,,,,,,,,,,,,,,,,,,,,,,,,,"Commonwealth v. S.M. Brown and M.H. Steele","Misdemeanor^^Indictment^^arrest warrant^^transport and posession of ardent spirits","Misdemeanor; Indictment",,"Rockingham County Circuit Court ","JMU Libraries",1924,"Craig Schaefer, Kayla Heslin, Selena St. Andre","This work has been identified as being free of known restrictions under copyright law, including all related and neighboring rights. (<a href=""https://creativecommons.org/publicdomain/mark/1.0/"" target=""_blank"" rel=""noreferrer noopener"">https://creativecommons.org/publicdomain/mark/1.0/</a>)",,PDF,,,RcPr-box3-059,,,,,,,,,,,,,,,,,,,,,,,,,,,,,,,,,,,,,,,,,,,"Brown,Steele",https://omeka.lib.jmu.edu/erp/files/original/fca4af4d028c5e792036b7590d9f0b2c.pdf,Text,"Rockingham County Prohibition Records: Criminal Cases",1,0
2865,https://omeka.lib.jmu.edu/erp/items/show/2865,,,,,,,,,,,,,,,,,,,,,,,,,,,,,,,,,,,,,,,,,"Commonwealth v. Russell Via and Lilly Shifflett","Misdemeanor^^not guilty^^posession of still^^manufacture^^sell^^offer^^trasport^^dispense^^advertise^^receive order for ardent spirits","Misdemeanor; Not Guilty",,"Rockingham County Circuit Court ","JMU Libraries",1922,"Craig Schaefer, Kayla Heslin, Selena St. Andre","This work has been identified as being free of known restrictions under copyright law, including all related and neighboring rights. (<a href=""https://creativecommons.org/publicdomain/mark/1.0/"" target=""_blank"" rel=""noreferrer noopener"">https://creativecommons.org/publicdomain/mark/1.0/</a>)",,"PDF ",,,RcPr-box2-046,,,,,,,,,,,,,,,,,,,,,,,,,,,,,,,,,,,,,,,,,,,"Shifflett,Via",https://omeka.lib.jmu.edu/erp/files/original/483428a2b1efc3c21c1f520cdcee89a5.pdf,Text,"Rockingham County Prohibition Records: Criminal Cases",1,0
3367,https://omeka.lib.jmu.edu/erp/items/show/3367,,,,,,,,,,,,,,,,,,,,,,,,,,,,,,,,,,,,,,,,,"Commonwealth v. Russell Turner","Misdemeanor^^not guilty^^posession of ardent spirits-moonshine","Misdemeanor; Not Guilty",,"Rockingham County Circuit Court ","JMU Libraries",1932,"Craig Schaefer, Kayla Heslin, Selena St. Andre","This work has been identified as being free of known restrictions under copyright law, including all related and neighboring rights. (<a href=""https://creativecommons.org/publicdomain/mark/1.0/"" target=""_blank"" rel=""noreferrer noopener"">https://creativecommons.org/publicdomain/mark/1.0/</a>)",,"PDF ",,,RcPr-box10-021,,,,,,,,,,,,,,,,,,,,,,,,,,,,,,,,,,,,,,,,,,,Turner,https://omeka.lib.jmu.edu/erp/files/original/b2089c944525e5c8fb31e512658702c6.pdf,Text,"Rockingham County Prohibition Records: Criminal Cases",1,0
3366,https://omeka.lib.jmu.edu/erp/items/show/3366,,,,,,,,,,,,,,,,,,,,,,,,,,,,,,,,,,,,,,,,,"Commonwealth v. Russell Turner","Misdemeanor^^guilty^^operated an automobile under the influence","Misdemeanor; Guilty",,"Rockingham County Circuit Court ","JMU Libraries",1932,"Craig Schaefer, Kayla Heslin, Selena St. Andre","This work has been identified as being free of known restrictions under copyright law, including all related and neighboring rights. (<a href=""https://creativecommons.org/publicdomain/mark/1.0/"" target=""_blank"" rel=""noreferrer noopener"">https://creativecommons.org/publicdomain/mark/1.0/</a>)",,"PDF ",,,RcPr-box10-020,,,,,,,,,,,,,,,,,,,,,,,,,,,,,,,,,,,,,,,,,,,Turner,https://omeka.lib.jmu.edu/erp/files/original/60854a9adddec493f73d94d5165e7688.pdf,Text,"Rockingham County Prohibition Records: Criminal Cases",1,0
3111,https://omeka.lib.jmu.edu/erp/items/show/3111,,,,,,,,,,,,,,,,,,,,,,,,,,,,,,,,,,,,,,,,,"Commonwealth v. Russell Smith",Misdemeanor^^Indictment^^posession,"Misdemeanor; Indictment",,"Rockingham County Circuit Court ","JMU Libraries",1927,"Craig Schaefer, Kayla Heslin, Selena St. Andre","This work has been identified as being free of known restrictions under copyright law, including all related and neighboring rights. (<a href=""https://creativecommons.org/publicdomain/mark/1.0/"" target=""_blank"" rel=""noreferrer noopener"">https://creativecommons.org/publicdomain/mark/1.0/</a>)",,"PDF ",,,RcPr-box7-002,,,,,,,,,,,,,,,,,,,,,,,,,,,,,,,,,,,,,,,,,,,Smith,https://omeka.lib.jmu.edu/erp/files/original/699ff528abc21b770a691914314c21dd.pdf,Text,"Rockingham County Prohibition Records: Criminal Cases",1,0
3225,https://omeka.lib.jmu.edu/erp/items/show/3225,,,,,,,,,,,,,,,,,,,,,,,,,,,,,,,,,,,,,,,,,"Commonwealth v. Russell Davis","Misdemeanor^^Indictment^^posession ardent spirits","Misdemeanor; Indictment",,"Rockingham County Circuit Court ","JMU Libraries",1930,"Craig Schaefer, Kayla Heslin, Selena St. Andre","This work has been identified as being free of known restrictions under copyright law, including all related and neighboring rights. (<a href=""https://creativecommons.org/publicdomain/mark/1.0/"" target=""_blank"" rel=""noreferrer noopener"">https://creativecommons.org/publicdomain/mark/1.0/</a>)",,PDF,,,RcPr-box8-033,,,,,,,,,,,,,,,,,,,,,,,,,,,,,,,,,,,,,,,,,,,Davis,https://omeka.lib.jmu.edu/erp/files/original/0f4d97a4c6556c40f1f2fa2e7fdf3a38.pdf,Text,"Rockingham County Prohibition Records: Criminal Cases",1,0
3288,https://omeka.lib.jmu.edu/erp/items/show/3288,,,,,,,,,,,,,,,,,,,,,,,,,,,,,,,,,,,,,,,,,"Commonwealth v. Roy Zirkle","Misdemeanor^^Indictment^^operated an automobile under the influence^^30 days in jail & $100 fine","Misdemeanor; Indictment",,"Rockingham County Circuit Court ","JMU Libraries",1930,"Craig Schaefer, Kayla Heslin, Selena St. Andre","This work has been identified as being free of known restrictions under copyright law, including all related and neighboring rights. (<a href=""https://creativecommons.org/publicdomain/mark/1.0/"" target=""_blank"" rel=""noreferrer noopener"">https://creativecommons.org/publicdomain/mark/1.0/</a>)",,"PDF ",,,RcPr-box9-014,,,,,,,,,,,,,,,,,,,,,,,,,,,,,,,,,,,,,,,,,,,Zirkle,https://omeka.lib.jmu.edu/erp/files/original/b814f9983751a377759468ce03307680.pdf,Text,"Rockingham County Prohibition Records: Criminal Cases",1,0
3207,https://omeka.lib.jmu.edu/erp/items/show/3207,,,,,,,,,,,,,,,,,,,,,,,,,,,,,,,,,,,,,,,,,"Commonwealth v. Roy Turner","Misdemeanor^^Indictment^^operated an automobile under the influence","Misdemeanor; Indictment",,"Rockingham County Circuit Court ","JMU Libraries",1929,"Craig Schaefer, Kayla Heslin, Selena St. Andre","This work has been identified as being free of known restrictions under copyright law, including all related and neighboring rights. (<a href=""https://creativecommons.org/publicdomain/mark/1.0/"" target=""_blank"" rel=""noreferrer noopener"">https://creativecommons.org/publicdomain/mark/1.0/</a>)",,PDF,,,RcPr-box8-015,,,,,,,,,,,,,,,,,,,,,,,,,,,,,,,,,,,,,,,,,,,Turner,https://omeka.lib.jmu.edu/erp/files/original/81df1a690f043b9758a75eb747eb7ca1.pdf,Text,"Rockingham County Prohibition Records: Criminal Cases",1,0
2746,https://omeka.lib.jmu.edu/erp/items/show/2746,,,,,,,,,,,,,,,,,,,,,,,,,,,,,,,,,,,,,,,,,"Commonwealth v. Roy L. Fridley","warrant case^^guilty^^operate automobile under the influence","Warrant Case; Guilty",,"Rockingham County Circuit Court ","JMU Libraries",1916,"Craig Schaefer, Kayla Heslin, Selena St. Andre","This work has been identified as being free of known restrictions under copyright law, including all related and neighboring rights. (<a href=""https://creativecommons.org/publicdomain/mark/1.0/"" target=""_blank"" rel=""noreferrer noopener"">https://creativecommons.org/publicdomain/mark/1.0/</a>)",,"PDF ",,,RcPr-box1-007,,,,,,,,,,,,,,,,,,,,,,,,,,,,,,,,,,,,,,,,,,,Fridley,https://omeka.lib.jmu.edu/erp/files/original/c24de3be98c20770ab45206f64b01a74.pdf,Text,"Rockingham County Prohibition Records: Criminal Cases",1,0
