﻿"Item Id","Item URI","Dublin Core:Alternative Title","Dublin Core:Abstract","Dublin Core:Table Of Contents","Dublin Core:Date Available","Dublin Core:Date Created","Dublin Core:Date Accepted","Dublin Core:Date Copyrighted","Dublin Core:Date Submitted","Dublin Core:Date Issued","Dublin Core:Date Modified","Dublin Core:Date Valid","Dublin Core:Access Rights","Dublin Core:License","Dublin Core:Conforms To","Dublin Core:Has Format","Dublin Core:Has Part","Dublin Core:Has Version","Dublin Core:Is Format Of","Dublin Core:Is Part Of","Dublin Core:Is Referenced By","Dublin Core:Is Replaced By","Dublin Core:Is Required By","Dublin Core:Is Version Of","Dublin Core:References","Dublin Core:Replaces","Dublin Core:Requires","Dublin Core:Extent","Dublin Core:Medium","Dublin Core:Bibliographic Citation","Dublin Core:Spatial Coverage","Dublin Core:Temporal Coverage","Dublin Core:Accrual Method","Dublin Core:Accrual Periodicity","Dublin Core:Accrual Policy","Dublin Core:Audience","Dublin Core:Audience Education Level","Dublin Core:Mediator","Dublin Core:Instructional Method","Dublin Core:Provenance","Dublin Core:Rights Holder","Dublin Core:Title","Dublin Core:Subject","Dublin Core:Description","Dublin Core:Creator","Dublin Core:Source","Dublin Core:Publisher","Dublin Core:Date","Dublin Core:Contributor","Dublin Core:Rights","Dublin Core:Relation","Dublin Core:Format","Dublin Core:Language","Dublin Core:Type","Dublin Core:Identifier","Dublin Core:Coverage","Item Type Metadata:Text","Item Type Metadata:Interviewer","Item Type Metadata:Interviewee","Item Type Metadata:Location","Item Type Metadata:Transcription","Item Type Metadata:Local URL","Item Type Metadata:Original Format","Item Type Metadata:Physical Dimensions","Item Type Metadata:Duration","Item Type Metadata:Compression","Item Type Metadata:Producer","Item Type Metadata:Director","Item Type Metadata:Bit Rate/Frequency","Item Type Metadata:Time Summary","Item Type Metadata:Email Body","Item Type Metadata:Subject Line","Item Type Metadata:From","Item Type Metadata:To","Item Type Metadata:CC","Item Type Metadata:BCC","Item Type Metadata:Number of Attachments","Item Type Metadata:Standards","Item Type Metadata:Objectives","Item Type Metadata:Materials","Item Type Metadata:Lesson Plan Text","Item Type Metadata:URL","Item Type Metadata:Event Type","Item Type Metadata:Participants","Item Type Metadata:Birth Date","Item Type Metadata:Birthplace","Item Type Metadata:Death Date","Item Type Metadata:Occupation","Item Type Metadata:Biographical Text","Item Type Metadata:Bibliography","Item Type Metadata:Player","Item Type Metadata:Episode","Item Type Metadata:Season","Item Type Metadata:Episode Type","Item Type Metadata:Explicit","Item Type Metadata:Block","PDF Text:Text",tags,file,itemType,collection,public,featured
2761,https://omeka.lib.jmu.edu/erp/items/show/2761,,,,,,,,,,,,,,,,,,,,,,,,,,,,,,,,,,,,,,,,,"Commonwealth v. Bert Propst",,,,"Rockingham County Circuit Court ","JMU Libraries",1917,"Craig Schaefer, Kayla Heslin, Selena St. Andre","This work has been identified as being free of known restrictions under copyright law, including all related and neighboring rights. (<a href=""https://creativecommons.org/publicdomain/mark/1.0/"" target=""_blank"" rel=""noreferrer noopener"">https://creativecommons.org/publicdomain/mark/1.0/</a>)",,"PDF ",,,RcPr-box1-022,,,,,,,,,,,,,,,,,,,,,,,,,,,,,,,,,,,,,,,,,,,Propst,https://omeka.lib.jmu.edu/erp/files/original/da9fe3d71ab948c0a12b6a98da83bec4.pdf,Text,"Rockingham County Prohibition Records: Criminal Cases",1,0
3354,https://omeka.lib.jmu.edu/erp/items/show/3354,,,,,,,,,,,,,,,,,,,,,,,,,,,,,,,,,,,,,,,,,"Commonwealth v. Bessie Moubray and Irene Moubray","Misdemeanor^^Indictment^^summons^^posession of ardent spirits-homebrew","Misdemeanor; Indictment",,"Rockingham County Circuit Court ","JMU Libraries",1932,"Craig Schaefer, Kayla Heslin, Selena St. Andre","This work has been identified as being free of known restrictions under copyright law, including all related and neighboring rights. (<a href=""https://creativecommons.org/publicdomain/mark/1.0/"" target=""_blank"" rel=""noreferrer noopener"">https://creativecommons.org/publicdomain/mark/1.0/</a>)",,"PDF ",,,RcPr-box10-008,,,,,,,,,,,,,,,,,,,,,,,,,,,,,,,,,,,,,,,,,,,Moubray,https://omeka.lib.jmu.edu/erp/files/original/5ec1f2d330d0bddfb119dc398a65fe6e.pdf,Text,"Rockingham County Prohibition Records: Criminal Cases",1,0
6713,https://omeka.lib.jmu.edu/erp/items/show/6713,,,,,,,,,,,,,,,,,,,,,,,,,,,,,,,,,,,,,,,,,"Commonwealth v. Betty Johnson",Felony^^Bigamy^^Bigamy,"Defendant charged with felony bigamy.","Rockingham County Criminal Court",,"JMU Libraries",1911,"Jennifer Taylor","This work has been identified as being free of known restrictions under copyright law, including all related and neighboring rights.<br /><a href=""https://creativecommons.org/publicdomain/mark/1.0/"" target=""_blank"" rel=""noreferrer noopener"">https://creativecommons.org/publicdomain/mark/1.0/</a>",,PDF,,,CCR001_006_182,,,,,,,,,,,,,,,,,,,,,,,,,,,,,,,,,,,,,,,,,,,"Harris,Johnson",https://omeka.lib.jmu.edu/erp/files/original/Rockingham_County_Criminal_Court_Criminal_Cases/ccr001_006_182-commonwealth-v-betty-johnson.pdf,Text,"Rockingham County Criminal Court: Criminal Cases",1,1
3271,https://omeka.lib.jmu.edu/erp/items/show/3271,,,,,,,,,,,,,,,,,,,,,,,,,,,,,,,,,,,,,,,,,"Commonwealth v. Beulah Shifflett","Misdemeanor^^Information^^Information for violation","Misdemeanor; Information",,"Rockingham County Circuit Court ","JMU Libraries",1930,"Craig Schaefer, Kayla Heslin, Selena St. Andre","This work has been identified as being free of known restrictions under copyright law, including all related and neighboring rights. (<a href=""https://creativecommons.org/publicdomain/mark/1.0/"" target=""_blank"" rel=""noreferrer noopener"">https://creativecommons.org/publicdomain/mark/1.0/</a>)",,PDF,,,RcPr-box8-079,,,,,,,,,,,,,,,,,,,,,,,,,,,,,,,,,,,,,,,,,,,Shifflett,https://omeka.lib.jmu.edu/erp/files/original/757c20c8d7f0bcbdba6b12c751ec9586.pdf,Text,"Rockingham County Prohibition Records: Criminal Cases",1,0
3163,https://omeka.lib.jmu.edu/erp/items/show/3163,,,,,,,,,,,,,,,,,,,,,,,,,,,,,,,,,,,,,,,,,"Commonwealth v. Beulah Shifflett and Hobart Reedy","Misdemeanor^^Indictment^^operating a still^^350 gallosn spirits","Misdemeanor; Indictment",,"Rockingham County Circuit Court ","JMU Libraries",1928,"Craig Schaefer, Kayla Heslin, Selena St. Andre","This work has been identified as being free of known restrictions under copyright law, including all related and neighboring rights. (<a href=""https://creativecommons.org/publicdomain/mark/1.0/"" target=""_blank"" rel=""noreferrer noopener"">https://creativecommons.org/publicdomain/mark/1.0/</a>)",,"PDF ",,,RcPr-box7-054,,,,,,,,,,,,,,,,,,,,,,,,,,,,,,,,,,,,,,,,,,,"Reedy,Shifflett",https://omeka.lib.jmu.edu/erp/files/original/0b22d5b09f78b2fa79bcd08bfe1f9c64.pdf,Text,"Rockingham County Prohibition Records: Criminal Cases",1,0
6712,https://omeka.lib.jmu.edu/erp/items/show/6712,,,,,,,,,,,,,,,,,,,,,,,,,,,,,,,,,,,,,,,,,"Commonwealth v. Brainard Marshall","Felony^^Manslaughter ^^Manslaughter ","Defendant charged with felony manslaughter.","Rockingham County Criminal Court",,"JMU Libraries",1917,"Jennifer Taylor","This work has been identified as being free of known restrictions under copyright law, including all related and neighboring rights.<br /><a href=""https://creativecommons.org/publicdomain/mark/1.0/"" target=""_blank"" rel=""noreferrer noopener"">https://creativecommons.org/publicdomain/mark/1.0/</a>",,PDF,,,CCR001_007_212,,,,,,,,,,,,,,,,,,,,,,,,,,,,,,,,,,,,,,,,,,,"Frazier,Marshall",https://omeka.lib.jmu.edu/erp/files/original/Rockingham_County_Criminal_Court_Criminal_Cases/ccr001_007_212-commonwealth-v-brainard-marshall.pdf,Text,"Rockingham County Criminal Court: Criminal Cases",1,1
3145,https://omeka.lib.jmu.edu/erp/items/show/3145,,,,,,,,,,,,,,,,,,,,,,,,,,,,,,,,,,,,,,,,,"Commonwealth v. Brice Jenkins","Misdemeanor^^Indictment^^posession^^tried to destroy evidence","Misdemeanor; Indictment",,"Rockingham County Circuit Court ","JMU Libraries",1928,"Craig Schaefer, Kayla Heslin, Selena St. Andre","This work has been identified as being free of known restrictions under copyright law, including all related and neighboring rights. (<a href=""https://creativecommons.org/publicdomain/mark/1.0/"" target=""_blank"" rel=""noreferrer noopener"">https://creativecommons.org/publicdomain/mark/1.0/</a>)",,"PDF ",,,RcPr-box7-036,,,,,,,,,,,,,,,,,,,,,,,,,,,,,,,,,,,,,,,,,,,Jenkins,https://omeka.lib.jmu.edu/erp/files/original/6c54298c29b1b56ae30c2a90cf5adfeb.pdf,Text,"Rockingham County Prohibition Records: Criminal Cases",1,0
6711,https://omeka.lib.jmu.edu/erp/items/show/6711,,,,,,,,,,,,,,,,,,,,,,,,,,,,,,,,,,,,,,,,,"Commonwealth v. Brown et al","Misdemeanor^^Failure to Provide Adequate Fish Ladders","Defendants charged with misdemeanor failure to provide adequate fish ladders.","Rockingham County Criminal Court",,"JMU Libraries",1925,"Jennifer Taylor","This work has been identified as being free of known restrictions under copyright law, including all related and neighboring rights.<br /><a href=""https://creativecommons.org/publicdomain/mark/1.0/"" target=""_blank"" rel=""noreferrer noopener"">https://creativecommons.org/publicdomain/mark/1.0/</a>",,PDF,,,CCR001_009_270,,,,,,,,,,,,,,,,,,,,,,,,,,,,,,,,,,,,,,,,,,,"Brown,Driver,Rhodes",https://omeka.lib.jmu.edu/erp/files/original/Rockingham_County_Criminal_Court_Criminal_Cases/ccr001_009_270-commonwealth-v-brown-et-al.pdf,Text,"Rockingham County Criminal Court: Criminal Cases",1,1
3304,https://omeka.lib.jmu.edu/erp/items/show/3304,,,,,,,,,,,,,,,,,,,,,,,,,,,,,,,,,,,,,,,,,"Commonwealth v. Bruce Fulk","Misdemeanor^^Indictment^^operated an automobile under the influence^^capias warrant","Misdemeanor; Indictment",,"Rockingham County Circuit Court ","JMU Libraries",1931,"Craig Schaefer, Kayla Heslin, Selena St. Andre","This work has been identified as being free of known restrictions under copyright law, including all related and neighboring rights. (<a href=""https://creativecommons.org/publicdomain/mark/1.0/"" target=""_blank"" rel=""noreferrer noopener"">https://creativecommons.org/publicdomain/mark/1.0/</a>)",,"PDF ",,,RcPr-box9-030,,,,,,,,,,,,,,,,,,,,,,,,,,,,,,,,,,,,,,,,,,,Fulk,https://omeka.lib.jmu.edu/erp/files/original/13fcae035d24b632dab19d95b331abdb.pdf,Text,"Rockingham County Prohibition Records: Criminal Cases",1,0
2845,https://omeka.lib.jmu.edu/erp/items/show/2845,,,,,,,,,,,,,,,,,,,,,,,,,,,,,,,,,,,,,,,,,"Commonwealth v. Bryan Conley","Misdemeanor^^not guilty^^manufacture^^sell^^offer^^trasport^^dispense^^advertise^^receive order for ardent spirits^^provided ardent spirits to a minor","Misdemeanor; Not Guilty",,"Rockingham County Circuit Court ","JMU Libraries",1922,"Craig Schaefer, Kayla Heslin, Selena St. Andre","This work has been identified as being free of known restrictions under copyright law, including all related and neighboring rights. (<a href=""https://creativecommons.org/publicdomain/mark/1.0/"" target=""_blank"" rel=""noreferrer noopener"">https://creativecommons.org/publicdomain/mark/1.0/</a>)",,"PDF ",,,RcPr-box2-026,,,,,,,,,,,,,,,,,,,,,,,,,,,,,,,,,,,,,,,,,,,Conley,https://omeka.lib.jmu.edu/erp/files/original/1231aba127b1a1a097b04c8f86bcc2a5.pdf,Text,"Rockingham County Prohibition Records: Criminal Cases",1,0
3144,https://omeka.lib.jmu.edu/erp/items/show/3144,,,,,,,,,,,,,,,,,,,,,,,,,,,,,,,,,,,,,,,,,"Commonwealth v. Bryan Hoover","Misdemeanor^^guilty^^operated an automobile under the influence^^plead guilty","Misdemeanor; Guilty",,"Rockingham County Circuit Court ","JMU Libraries",1928,"Craig Schaefer, Kayla Heslin, Selena St. Andre","This work has been identified as being free of known restrictions under copyright law, including all related and neighboring rights. (<a href=""https://creativecommons.org/publicdomain/mark/1.0/"" target=""_blank"" rel=""noreferrer noopener"">https://creativecommons.org/publicdomain/mark/1.0/</a>)",,"PDF ",,,RcPr-box7-035,,,,,,,,,,,,,,,,,,,,,,,,,,,,,,,,,,,,,,,,,,,Hoover,https://omeka.lib.jmu.edu/erp/files/original/b8361caa10ff73e361a0d52d7ff72c09.pdf,Text,"Rockingham County Prohibition Records: Criminal Cases",1,0
3329,https://omeka.lib.jmu.edu/erp/items/show/3329,,,,,,,,,,,,,,,,,,,,,,,,,,,,,,,,,,,,,,,,,"Commonwealth v. C.A. Bailey and R.L. Bailey","Misdemeanor^^not guilty^^posession of still","Misdemeanor; Not Guilty",,"Rockingham County Circuit Court ","JMU Libraries",1932,"Craig Schaefer, Kayla Heslin, Selena St. Andre","This work has been identified as being free of known restrictions under copyright law, including all related and neighboring rights. (<a href=""https://creativecommons.org/publicdomain/mark/1.0/"" target=""_blank"" rel=""noreferrer noopener"">https://creativecommons.org/publicdomain/mark/1.0/</a>)",,"PDF ",,,RcPr-box9-055,,,,,,,,,,,,,,,,,,,,,,,,,,,,,,,,,,,,,,,,,,,Bailey,https://omeka.lib.jmu.edu/erp/files/original/c074633653753c4946de8e2c9f39b9bc.pdf,Text,"Rockingham County Prohibition Records: Criminal Cases",1,0
6710,https://omeka.lib.jmu.edu/erp/items/show/6710,,,,,,,,,,,,,,,,,,,,,,,,,,,,,,,,,,,,,,,,,"Commonwealth v. C.A. Hyde",Felony^^Forgery,"Defendant charged with felony forgery.","Rockingham County Criminal Court",,"JMU Libraries",1909,"Jennifer Taylor","This work has been identified as being free of known restrictions under copyright law, including all related and neighboring rights.<br /><a href=""https://creativecommons.org/publicdomain/mark/1.0/"" target=""_blank"" rel=""noreferrer noopener"">https://creativecommons.org/publicdomain/mark/1.0/</a>",,PDF,,,CCR001_005_146,,,,,,,,,,,,,,,,,,,,,,,,,,,,,,,,,,,,,,,,,,,"Hyde,Saunders",https://omeka.lib.jmu.edu/erp/files/original/Rockingham_County_Criminal_Court_Criminal_Cases/ccr001_005_146-commonwealth-v-ca-hyde.pdf,Text,"Rockingham County Criminal Court: Criminal Cases",1,1
3008,https://omeka.lib.jmu.edu/erp/items/show/3008,,,,,,,,,,,,,,,,,,,,,,,,,,,,,,,,,,,,,,,,,"Commonwealth v. C.C. Grimm",Felony^^guilty,"Felony; Guilty",,"Rockingham County Circuit Court ","JMU Libraries",1925,"Craig Schaefer, Kayla Heslin, Selena St. Andre","This work has been identified as being free of known restrictions under copyright law, including all related and neighboring rights. (<a href=""https://creativecommons.org/publicdomain/mark/1.0/"" target=""_blank"" rel=""noreferrer noopener"">https://creativecommons.org/publicdomain/mark/1.0/</a>)",,"PDF ",,,RcPr-box5-010,,,,,,,,,,,,,,,,,,,,,,,,,,,,,,,,,,,,,,,,,,,Grimm,https://omeka.lib.jmu.edu/erp/files/original/623a580d2d242b3cda800fa5a95bc321.pdf,Text,"Rockingham County Prohibition Records: Criminal Cases",1,0
6709,https://omeka.lib.jmu.edu/erp/items/show/6709,,,,,,,,,,,,,,,,,,,,,,,,,,,,,,,,,,,,,,,,,"Commonwealth v. C.C. Hedrick","Misdemeanor^^Sale of Alcohol to a Minor","Defendant charged with misdemeanor sale of alcohol to a minor.","Rockingham County Criminal Court",,"JMU Libraries",1912,"Jennifer Taylor","This work has been identified as being free of known restrictions under copyright law, including all related and neighboring rights.<br /><a href=""https://creativecommons.org/publicdomain/mark/1.0/"" target=""_blank"" rel=""noreferrer noopener"">https://creativecommons.org/publicdomain/mark/1.0/</a>",,PDF,,,CCR001_006_198,,,,,,,,,,,,,,,,,,,,,,,,,,,,,,,,,,,,,,,,,,,Hedrick,https://omeka.lib.jmu.edu/erp/files/original/Rockingham_County_Criminal_Court_Criminal_Cases/ccr001_006_198-commonwealth-v-cc-hedrick.pdf,Text,"Rockingham County Criminal Court: Criminal Cases",1,1
3353,https://omeka.lib.jmu.edu/erp/items/show/3353,,,,,,,,,,,,,,,,,,,,,,,,,,,,,,,,,,,,,,,,,"Commonwealth v. C.D. May","Misdemeanor^^Indictment^^operated an automobile under the influence","Misdemeanor; Indictment",,"Rockingham County Circuit Court ","JMU Libraries",1932,"Craig Schaefer, Kayla Heslin, Selena St. Andre","This work has been identified as being free of known restrictions under copyright law, including all related and neighboring rights. (<a href=""https://creativecommons.org/publicdomain/mark/1.0/"" target=""_blank"" rel=""noreferrer noopener"">https://creativecommons.org/publicdomain/mark/1.0/</a>)",,"PDF ",,,RcPr-box10-007,,,,,,,,,,,,,,,,,,,,,,,,,,,,,,,,,,,,,,,,,,,May,https://omeka.lib.jmu.edu/erp/files/original/dac2d5d48ae95bd81961ef7c5d3e84ba.pdf,Text,"Rockingham County Prohibition Records: Criminal Cases",1,0
2873,https://omeka.lib.jmu.edu/erp/items/show/2873,,,,,,,,,,,,,,,,,,,,,,,,,,,,,,,,,,,,,,,,,"Commonwealth v. C.E. (Buck) Carper","Misdemeanor^^guilty^^manufacture^^sell^^offer^^transport^^dispense^^advertise^^receive order for ardent spirits","Misdemeanor; Guilty",,"Rockingham County Circuit Court ","JMU Libraries",1923,"Craig Schaefer, Kayla Heslin, Selena St. Andre","This work has been identified as being free of known restrictions under copyright law, including all related and neighboring rights. (<a href=""https://creativecommons.org/publicdomain/mark/1.0/"" target=""_blank"" rel=""noreferrer noopener"">https://creativecommons.org/publicdomain/mark/1.0/</a>)",,"PDF ",,,RcPr-box2-054,,,,,,,,,,,,,,,,,,,,,,,,,,,,,,,,,,,,,,,,,,,Carper,https://omeka.lib.jmu.edu/erp/files/original/dc7058f91928e2f4b0aff1faf3864a04.pdf,Text,"Rockingham County Prohibition Records: Criminal Cases",1,0
3125,https://omeka.lib.jmu.edu/erp/items/show/3125,,,,,,,,,,,,,,,,,,,,,,,,,,,,,,,,,,,,,,,,,"Commonwealth v. C.E. Carper",Felony^^Indictment^^posession^^still,"Felony; Indictment",,"Rockingham County Circuit Court ","JMU Libraries",1928,"Craig Schaefer, Kayla Heslin, Selena St. Andre","This work has been identified as being free of known restrictions under copyright law, including all related and neighboring rights. (<a href=""https://creativecommons.org/publicdomain/mark/1.0/"" target=""_blank"" rel=""noreferrer noopener"">https://creativecommons.org/publicdomain/mark/1.0/</a>)",,"PDF ",,,RcPr-box7-016,,,,,,,,,,,,,,,,,,,,,,,,,,,,,,,,,,,,,,,,,,,Carper,https://omeka.lib.jmu.edu/erp/files/original/e295cb36d8133e91035fad6cb01dad49.pdf,Text,"Rockingham County Prohibition Records: Criminal Cases",1,0
2813,https://omeka.lib.jmu.edu/erp/items/show/2813,,,,,,,,,,,,,,,,,,,,,,,,,,,,,,,,,,,,,,,,,"Commonwealth v. C.F. Coakley",,,,"Rockingham County Circuit Court ","JMU Libraries",1921,"Craig Schaefer, Kayla Heslin, Selena St. Andre","This work has been identified as being free of known restrictions under copyright law, including all related and neighboring rights. (<a href=""https://creativecommons.org/publicdomain/mark/1.0/"" target=""_blank"" rel=""noreferrer noopener"">https://creativecommons.org/publicdomain/mark/1.0/</a>)",,"PDF ",,,RcPr-box1-074,,,,,,,,,,,,,,,,,,,,,,,,,,,,,,,,,,,,,,,,,,,Coakley,https://omeka.lib.jmu.edu/erp/files/original/a89aeece3e70ebed06585bb01c6559d9.pdf,Text,"Rockingham County Prohibition Records: Criminal Cases",1,0
3031,https://omeka.lib.jmu.edu/erp/items/show/3031,,,,,,,,,,,,,,,,,,,,,,,,,,,,,,,,,,,,,,,,,"Commonwealth v. C.H. Yager, J.H. Yager and Robert Davis","Misdemeanor^^Indictment^^C.H. found not guilty","Misdemeanor; Indictment",,"Rockingham County Circuit Court ","JMU Libraries",1925,"Craig Schaefer, Kayla Heslin, Selena St. Andre","This work has been identified as being free of known restrictions under copyright law, including all related and neighboring rights. (<a href=""https://creativecommons.org/publicdomain/mark/1.0/"" target=""_blank"" rel=""noreferrer noopener"">https://creativecommons.org/publicdomain/mark/1.0/</a>)",,"PDF ",,,RcPr-box5-033,,,,,,,,,,,,,,,,,,,,,,,,,,,,,,,,,,,,,,,,,,,"Davis,Yager",https://omeka.lib.jmu.edu/erp/files/original/8d58b1312995e7cfebfa478eb88beed6.pdf,Text,"Rockingham County Prohibition Records: Criminal Cases",1,0
