﻿"Item Id","Item URI","Dublin Core:Alternative Title","Dublin Core:Abstract","Dublin Core:Table Of Contents","Dublin Core:Date Available","Dublin Core:Date Created","Dublin Core:Date Accepted","Dublin Core:Date Copyrighted","Dublin Core:Date Submitted","Dublin Core:Date Issued","Dublin Core:Date Modified","Dublin Core:Date Valid","Dublin Core:Access Rights","Dublin Core:License","Dublin Core:Conforms To","Dublin Core:Has Format","Dublin Core:Has Part","Dublin Core:Has Version","Dublin Core:Is Format Of","Dublin Core:Is Part Of","Dublin Core:Is Referenced By","Dublin Core:Is Replaced By","Dublin Core:Is Required By","Dublin Core:Is Version Of","Dublin Core:References","Dublin Core:Replaces","Dublin Core:Requires","Dublin Core:Extent","Dublin Core:Medium","Dublin Core:Bibliographic Citation","Dublin Core:Spatial Coverage","Dublin Core:Temporal Coverage","Dublin Core:Accrual Method","Dublin Core:Accrual Periodicity","Dublin Core:Accrual Policy","Dublin Core:Audience","Dublin Core:Audience Education Level","Dublin Core:Mediator","Dublin Core:Instructional Method","Dublin Core:Provenance","Dublin Core:Rights Holder","Dublin Core:Title","Dublin Core:Subject","Dublin Core:Description","Dublin Core:Creator","Dublin Core:Source","Dublin Core:Publisher","Dublin Core:Date","Dublin Core:Contributor","Dublin Core:Rights","Dublin Core:Relation","Dublin Core:Format","Dublin Core:Language","Dublin Core:Type","Dublin Core:Identifier","Dublin Core:Coverage","Item Type Metadata:Text","Item Type Metadata:Interviewer","Item Type Metadata:Interviewee","Item Type Metadata:Location","Item Type Metadata:Transcription","Item Type Metadata:Local URL","Item Type Metadata:Original Format","Item Type Metadata:Physical Dimensions","Item Type Metadata:Duration","Item Type Metadata:Compression","Item Type Metadata:Producer","Item Type Metadata:Director","Item Type Metadata:Bit Rate/Frequency","Item Type Metadata:Time Summary","Item Type Metadata:Email Body","Item Type Metadata:Subject Line","Item Type Metadata:From","Item Type Metadata:To","Item Type Metadata:CC","Item Type Metadata:BCC","Item Type Metadata:Number of Attachments","Item Type Metadata:Standards","Item Type Metadata:Objectives","Item Type Metadata:Materials","Item Type Metadata:Lesson Plan Text","Item Type Metadata:URL","Item Type Metadata:Event Type","Item Type Metadata:Participants","Item Type Metadata:Birth Date","Item Type Metadata:Birthplace","Item Type Metadata:Death Date","Item Type Metadata:Occupation","Item Type Metadata:Biographical Text","Item Type Metadata:Bibliography","Item Type Metadata:Player","Item Type Metadata:Episode","Item Type Metadata:Season","Item Type Metadata:Episode Type","Item Type Metadata:Explicit","Item Type Metadata:Block","PDF Text:Text",tags,file,itemType,collection,public,featured
4194,https://omeka.lib.jmu.edu/erp/items/show/4194,,,,,,,,,,,,,,,,,,,,,,,,,,,,,,,,,,,,,,,,,"Indenture of Apprenticeship, John Brown to John Bare (Bane/Bone)",,,"Overseers of the Poor",,"JMU Libraries ",1794,,"This work has been identified as being free of known restrictions under copyright law, including all related and neighboring rights. (<a href=""https://creativecommons.org/publicdomain/mark/1.0/"">https://creativecommons.org/publicdomain/mark/1.0/</a>)",,"PDF ",,,Osp003_001_021,,,,,,,,,,,,,,,,,,,,,,,,,,,,,,,,,,,,,,,,,,,"Bare,Brown",https://omeka.lib.jmu.edu/erp/files/original/525298430ed569a50d0175d385e7cad8.pdf,Text,"Overseers of the Poor: Indentures of Apprenticeship",1,0
4193,https://omeka.lib.jmu.edu/erp/items/show/4193,,,,,,,,,,,,,,,,,,,,,,,,,,,,,,,,,,,,,,,,,"Indenture of Apprenticeship, John Bright Jr to John Bright Sr",,Tanner,"Overseers of the Poor",,"JMU Libraries ",1794,,"This work has been identified as being free of known restrictions under copyright law, including all related and neighboring rights. (<a href=""https://creativecommons.org/publicdomain/mark/1.0/"">https://creativecommons.org/publicdomain/mark/1.0/</a>)",,"PDF ",,,Osp003_001_020,,,,,,,,,,,,,,,,,,,,,,,,,,,,,,,,,,,,,,,,,,,Bright,"https://omeka.lib.jmu.edu/erp/files/original/5e3a410d0ca763124675603b3e10df3e.pdf,https://omeka.lib.jmu.edu/erp/files/original/c0176772890a80dd81625285c3c48db6.pdf",Text,"Overseers of the Poor: Indentures of Apprenticeship",1,0
4336,https://omeka.lib.jmu.edu/erp/items/show/4336,,,,,,,,,,,,,,,,,,,,,,,,,,,,,,,,,,,,,,,,,"Indenture of Apprenticeship, Jesse Shuemake to William Seal ",,Blacksmith,"Overseers of the Poor",,"JMU Libraries ",1823,,"This work has been identified as being free of known restrictions under copyright law, including all related and neighboring rights. (<a href=""https://creativecommons.org/publicdomain/mark/1.0/"">https://creativecommons.org/publicdomain/mark/1.0/</a>)",,"PDF ",,,Osp003_003_049,,,,,,,,,,,,,,,,,,,,,,,,,,,,,,,,,,,,,,,,,,,"Seal,Shuemake",https://omeka.lib.jmu.edu/erp/files/original/5404048c2331f5c99417e4f266d2fd7d.pdf,Text,"Overseers of the Poor: Indentures of Apprenticeship",1,0
4511,https://omeka.lib.jmu.edu/erp/items/show/4511,,,,,,,,,,,,,,,,,,,,,,,,,,,,,,,,,,,,,,,,,"Indenture of Apprenticeship, Jerry to William K Gailey ",,"housekeeping ","Overseers of the Poor",,"JMU Libraries ",1853,,"This work has been identified as being free of known restrictions under copyright law, including all related and neighboring rights. (<a href=""https://creativecommons.org/publicdomain/mark/1.0/"">https://creativecommons.org/publicdomain/mark/1.0/</a>)",,"PDF ",,,Osp003_006_018,,,,,,,,,,,,,,,,,,,,,,,,,,,,,,,,,,,,,,,,,,,Gailey,https://omeka.lib.jmu.edu/erp/files/original/ee213d61f65dd807b63d1e60aff533c3.pdf,Text,"Overseers of the Poor: Indentures of Apprenticeship",1,0
4509,https://omeka.lib.jmu.edu/erp/items/show/4509,,,,,,,,,,,,,,,,,,,,,,,,,,,,,,,,,,,,,,,,,"Indenture of Apprenticeship, Jerome Newman to Isaac Moffett ",,"farmer ","Overseers of the Poor",,"JMU Libraries ",1852,,"This work has been identified as being free of known restrictions under copyright law, including all related and neighboring rights. (<a href=""https://creativecommons.org/publicdomain/mark/1.0/"">https://creativecommons.org/publicdomain/mark/1.0/</a>)",,"PDF ",,,Osp003_006_016,,,,,,,,,,,,,,,,,,,,,,,,,,,,,,,,,,,,,,,,,,,"Moffett,Newman",https://omeka.lib.jmu.edu/erp/files/original/b2a8a13f56977d791148ab71cc3cc233.pdf,Text,"Overseers of the Poor: Indentures of Apprenticeship",1,0
4250,https://omeka.lib.jmu.edu/erp/items/show/4250,,,,,,,,,,,,,,,,,,,,,,,,,,,,,,,,,,,,,,,,,"Indenture of Apprenticeship, Jeremiah McKee to George Smaltz",,shoemaker,"Overseers of the Poor",,"JMU Libraries ",1811,,"This work has been identified as being free of known restrictions under copyright law, including all related and neighboring rights. (<a href=""https://creativecommons.org/publicdomain/mark/1.0/"">https://creativecommons.org/publicdomain/mark/1.0/</a>)",,"PDF ",,,Osp003_002_007,,,,,,,,,,,,,,,,,,,,,,,,,,,,,,,,,,,,,,,,,,,"Mckee,Smaltz","https://omeka.lib.jmu.edu/erp/files/original/acc0bbb5084c9b32ab0a69a8f62f381e.pdf,https://omeka.lib.jmu.edu/erp/files/original/df58e06a3590f254e05c08a0b297837c.pdf",Text,"Overseers of the Poor: Indentures of Apprenticeship",1,0
4431,https://omeka.lib.jmu.edu/erp/items/show/4431,,,,,,,,,,,,,,,,,,,,,,,,,,,,,,,,,,,,,,,,,"Indenture of Apprenticeship, Jehue Jones to Jacob Neff ",,,"Overseers of the Poor",,"JMU Libraries ",1837,,"This work has been identified as being free of known restrictions under copyright law, including all related and neighboring rights. (<a href=""https://creativecommons.org/publicdomain/mark/1.0/"">https://creativecommons.org/publicdomain/mark/1.0/</a>)",,"PDF ",,,Osp003_005_007,,,,,,,,,,,,,,,,,,,,,,,,,,,,,,,,,,,,,,,,,,,"Jones,Neff",https://omeka.lib.jmu.edu/erp/files/original/10708254828796f7e5cd16581fda537c.pdf,Text,"Overseers of the Poor: Indentures of Apprenticeship",1,0
4211,https://omeka.lib.jmu.edu/erp/items/show/4211,,,,,,,,,,,,,,,,,,,,,,,,,,,,,,,,,,,,,,,,,"Indenture of Apprenticeship, Jehu Gum to William Bryan ",,"Powder maker","Overseers of the Poor",,"JMU Libraries ",1799,,"This work has been identified as being free of known restrictions under copyright law, including all related and neighboring rights. (<a href=""https://creativecommons.org/publicdomain/mark/1.0/"">https://creativecommons.org/publicdomain/mark/1.0/</a>)",,"PDF ",,,Osp003_001_038,,,,,,,,,,,,,,,,,,,,,,,,,,,,,,,,,,,,,,,,,,,"Bryan,Gum","https://omeka.lib.jmu.edu/erp/files/original/b0ff8d234d91b97ab2512c9fd6eb3677.pdf,https://omeka.lib.jmu.edu/erp/files/original/6ecf8a073e8d3582dc12ef65b541f9d3.pdf",Text,"Overseers of the Poor: Indentures of Apprenticeship",1,0
4452,https://omeka.lib.jmu.edu/erp/items/show/4452,,,,,,,,,,,,,,,,,,,,,,,,,,,,,,,,,,,,,,,,,"Indenture of Apprenticeship, Jefferson to Richard Winfield ",,"African American, farmer ","Overseers of the Poor",,"JMU Libraries ",1840,,"This work has been identified as being free of known restrictions under copyright law, including all related and neighboring rights. (<a href=""https://creativecommons.org/publicdomain/mark/1.0/"">https://creativecommons.org/publicdomain/mark/1.0/</a>)",,"PDF ",,,Osp003_005_027,,,,,,,,,,,,,,,,,,,,,,,,,,,,,,,,,,,,,,,,,,,Winfield,"https://omeka.lib.jmu.edu/erp/files/original/11c58f6773c15ce067438c817f5f0048.pdf,https://omeka.lib.jmu.edu/erp/files/original/f75d94d4e3433efffe977551c72115a1.pdf",Text,"Overseers of the Poor: Indentures of Apprenticeship",1,0
4233,https://omeka.lib.jmu.edu/erp/items/show/4233,,,,,,,,,,,,,,,,,,,,,,,,,,,,,,,,,,,,,,,,,"Indenture of Apprenticeship, Jane Miller to Josiah Harrison ",,,"Overseers of the Poor",,"JMU Libraries ",1807,,"This work has been identified as being free of known restrictions under copyright law, including all related and neighboring rights. (<a href=""https://creativecommons.org/publicdomain/mark/1.0/"">https://creativecommons.org/publicdomain/mark/1.0/</a>)",,"PDF ",,,Osp003_001_060,,,,,,,,,,,,,,,,,,,,,,,,,,,,,,,,,,,,,,,,,,,"Harrison,Miller","https://omeka.lib.jmu.edu/erp/files/original/691bbef06fa477a68e7f0b4a192efd52.pdf,https://omeka.lib.jmu.edu/erp/files/original/4acb25a755ce26ffdcafc725af6825e6.pdf",Text,"Overseers of the Poor: Indentures of Apprenticeship",1,0
4338,https://omeka.lib.jmu.edu/erp/items/show/4338,,,,,,,,,,,,,,,,,,,,,,,,,,,,,,,,,,,,,,,,,"Indenture of Apprenticeship, James Winder to Daniel Matthews ",,"farmer ","Overseers of the Poor",,"JMU Libraries ",1823,,"This work has been identified as being free of known restrictions under copyright law, including all related and neighboring rights. (<a href=""https://creativecommons.org/publicdomain/mark/1.0/"">https://creativecommons.org/publicdomain/mark/1.0/</a>)",,"PDF ",,,Osp003_003_051,,,,,,,,,,,,,,,,,,,,,,,,,,,,,,,,,,,,,,,,,,,"Matthews,Winder",https://omeka.lib.jmu.edu/erp/files/original/fae520d87b071a2baf5bca00a73fb526.pdf,Text,"Overseers of the Poor: Indentures of Apprenticeship",1,0
4228,https://omeka.lib.jmu.edu/erp/items/show/4228,,,,,,,,,,,,,,,,,,,,,,,,,,,,,,,,,,,,,,,,,"Indenture of Apprenticeship, James Miller to Josiah Harrison ",,"Milling ","Overseers of the Poor",,"JMU Libraries ",1805,,"This work has been identified as being free of known restrictions under copyright law, including all related and neighboring rights. (<a href=""https://creativecommons.org/publicdomain/mark/1.0/"">https://creativecommons.org/publicdomain/mark/1.0/</a>)",,"PDF ",,,Osp003_001_055,,,,,,,,,,,,,,,,,,,,,,,,,,,,,,,,,,,,,,,,,,,"Harrison,Miller","https://omeka.lib.jmu.edu/erp/files/original/b502ffa161c99011534eb81185cccb10.pdf,https://omeka.lib.jmu.edu/erp/files/original/90c58743d1a17838bc3380fb2209e344.pdf",Text,"Overseers of the Poor: Indentures of Apprenticeship",1,0
4311,https://omeka.lib.jmu.edu/erp/items/show/4311,,,,,,,,,,,,,,,,,,,,,,,,,,,,,,,,,,,,,,,,,"Indenture of Apprenticeship, James Lowry to Abraham Knave ",,"African American, Blacksmith","Overseers of the Poor",,"JMU Libraries ",1820,,"This work has been identified as being free of known restrictions under copyright law, including all related and neighboring rights. (<a href=""https://creativecommons.org/publicdomain/mark/1.0/"">https://creativecommons.org/publicdomain/mark/1.0/</a>)",,"PDF ",,,Osp003_003_024,,,,,,,,,,,,,,,,,,,,,,,,,,,,,,,,,,,,,,,,,,,"Knave,Lowry","https://omeka.lib.jmu.edu/erp/files/original/2c7808de0bbc8307aee48e9155c54077.pdf,https://omeka.lib.jmu.edu/erp/files/original/f9c73968961d57770c610b3e4d06c690.pdf",Text,"Overseers of the Poor: Indentures of Apprenticeship",1,0
4357,https://omeka.lib.jmu.edu/erp/items/show/4357,,,,,,,,,,,,,,,,,,,,,,,,,,,,,,,,,,,,,,,,,"Indenture of Apprenticeship, James Holman to Isaac Hardesty ",,"African American, house servant","Overseers of the Poor",,"JMU Libraries ",1826,,"This work has been identified as being free of known restrictions under copyright law, including all related and neighboring rights. (<a href=""https://creativecommons.org/publicdomain/mark/1.0/"">https://creativecommons.org/publicdomain/mark/1.0/</a>)",,"PDF ",,,Osp003_004_006,,,,,,,,,,,,,,,,,,,,,,,,,,,,,,,,,,,,,,,,,,,"Hardesty,Holman",https://omeka.lib.jmu.edu/erp/files/original/3aaf0bab55d8a0cd73c4a9cc36566d32.pdf,Text,"Overseers of the Poor: Indentures of Apprenticeship",1,0
4466,https://omeka.lib.jmu.edu/erp/items/show/4466,,,,,,,,,,,,,,,,,,,,,,,,,,,,,,,,,,,,,,,,,"Indenture of Apprenticeship, James Gentry to George Moore ",,Blacksmith,"Overseers of the Poor",,"JMU Libraries ",1842,,"This work has been identified as being free of known restrictions under copyright law, including all related and neighboring rights. (<a href=""https://creativecommons.org/publicdomain/mark/1.0/"">https://creativecommons.org/publicdomain/mark/1.0/</a>)",,"PDF ",,,Osp003_005_041,,,,,,,,,,,,,,,,,,,,,,,,,,,,,,,,,,,,,,,,,,,"Gentry,Moore",https://omeka.lib.jmu.edu/erp/files/original/0f2ef3acfd26704689413e2b917cc454.pdf,Text,"Overseers of the Poor: Indentures of Apprenticeship",1,0
4436,https://omeka.lib.jmu.edu/erp/items/show/4436,,,,,,,,,,,,,,,,,,,,,,,,,,,,,,,,,,,,,,,,,"Indenture of Apprenticeship, James Dean to Benjamin Bowman ",,,"Overseers of the Poor",,"JMU Libraries ",1838,,"This work has been identified as being free of known restrictions under copyright law, including all related and neighboring rights. (<a href=""https://creativecommons.org/publicdomain/mark/1.0/"">https://creativecommons.org/publicdomain/mark/1.0/</a>)",,"PDF ",,,Osp003_005_012,,,,,,,,,,,,,,,,,,,,,,,,,,,,,,,,,,,,,,,,,,,"Bowman,Dean",https://omeka.lib.jmu.edu/erp/files/original/afb9452785f476e8d07404158c2f80bb.pdf,Text,"Overseers of the Poor: Indentures of Apprenticeship",1,0
4423,https://omeka.lib.jmu.edu/erp/items/show/4423,,,,,,,,,,,,,,,,,,,,,,,,,,,,,,,,,,,,,,,,,"Indenture of Apprenticeship, James Byrd to Leonard Tutwiler",,"African American, skin dressers and glover","Overseers of the Poor",,"JMU Libraries ",1835,,"This work has been identified as being free of known restrictions under copyright law, including all related and neighboring rights. (<a href=""https://creativecommons.org/publicdomain/mark/1.0/"">https://creativecommons.org/publicdomain/mark/1.0/</a>)",,"PDF ",,,Osp003_004_071,,,,,,,,,,,,,,,,,,,,,,,,,,,,,,,,,,,,,,,,,,,"Byrd,Tutwiler",https://omeka.lib.jmu.edu/erp/files/original/e622be1893dc333d6715557ff7fe8625.pdf,Text,"Overseers of the Poor: Indentures of Apprenticeship",1,0
4389,https://omeka.lib.jmu.edu/erp/items/show/4389,,,,,,,,,,,,,,,,,,,,,,,,,,,,,,,,,,,,,,,,,"Indenture of Apprenticeship, James Brown to David Henton",,"farmer ","Overseers of the Poor",,"JMU Libraries ",1830,,"This work has been identified as being free of known restrictions under copyright law, including all related and neighboring rights. (<a href=""https://creativecommons.org/publicdomain/mark/1.0/"">https://creativecommons.org/publicdomain/mark/1.0/</a>)",,"PDF ",,,Osp003_004_038,,,,,,,,,,,,,,,,,,,,,,,,,,,,,,,,,,,,,,,,,,,"Brown,Henton",https://omeka.lib.jmu.edu/erp/files/original/595be4e701b7890b928502cf6d57ef18.pdf,Text,"Overseers of the Poor: Indentures of Apprenticeship",1,0
4344,https://omeka.lib.jmu.edu/erp/items/show/4344,,,,,,,,,,,,,,,,,,,,,,,,,,,,,,,,,,,,,,,,,"Indenture of Apprenticeship, James Adams to Jacob Earbaugh Jr ",,"Farmer ","Overseers of the Poor",,"JMU Libraries ",1825,,"This work has been identified as being free of known restrictions under copyright law, including all related and neighboring rights. (<a href=""https://creativecommons.org/publicdomain/mark/1.0/"">https://creativecommons.org/publicdomain/mark/1.0/</a>)",,"PDF ",,,Osp003_003_057,,,,,,,,,,,,,,,,,,,,,,,,,,,,,,,,,,,,,,,,,,,"Adams,Jr",https://omeka.lib.jmu.edu/erp/files/original/04c7ca628824afc20309fc31310cc8e6.pdf,Text,"Overseers of the Poor: Indentures of Apprenticeship",1,0
4387,https://omeka.lib.jmu.edu/erp/items/show/4387,,,,,,,,,,,,,,,,,,,,,,,,,,,,,,,,,,,,,,,,,"Indenture of Apprenticeship, Jacob Vance to Henry Berry ",,"farmer ","Overseers of the Poor",,"JMU Libraries ",1829,,"This work has been identified as being free of known restrictions under copyright law, including all related and neighboring rights. (<a href=""https://creativecommons.org/publicdomain/mark/1.0/"">https://creativecommons.org/publicdomain/mark/1.0/</a>)",,"PDF ",,,Osp003_004_036,,,,,,,,,,,,,,,,,,,,,,,,,,,,,,,,,,,,,,,,,,,"Berry,Vance",https://omeka.lib.jmu.edu/erp/files/original/ce2113a460a27f8035823f2f32782449.pdf,Text,"Overseers of the Poor: Indentures of Apprenticeship",1,0
