﻿"Item Id","Item URI","Dublin Core:Alternative Title","Dublin Core:Abstract","Dublin Core:Table Of Contents","Dublin Core:Date Available","Dublin Core:Date Created","Dublin Core:Date Accepted","Dublin Core:Date Copyrighted","Dublin Core:Date Submitted","Dublin Core:Date Issued","Dublin Core:Date Modified","Dublin Core:Date Valid","Dublin Core:Access Rights","Dublin Core:License","Dublin Core:Conforms To","Dublin Core:Has Format","Dublin Core:Has Part","Dublin Core:Has Version","Dublin Core:Is Format Of","Dublin Core:Is Part Of","Dublin Core:Is Referenced By","Dublin Core:Is Replaced By","Dublin Core:Is Required By","Dublin Core:Is Version Of","Dublin Core:References","Dublin Core:Replaces","Dublin Core:Requires","Dublin Core:Extent","Dublin Core:Medium","Dublin Core:Bibliographic Citation","Dublin Core:Spatial Coverage","Dublin Core:Temporal Coverage","Dublin Core:Accrual Method","Dublin Core:Accrual Periodicity","Dublin Core:Accrual Policy","Dublin Core:Audience","Dublin Core:Audience Education Level","Dublin Core:Mediator","Dublin Core:Instructional Method","Dublin Core:Provenance","Dublin Core:Rights Holder","Dublin Core:Title","Dublin Core:Subject","Dublin Core:Description","Dublin Core:Creator","Dublin Core:Source","Dublin Core:Publisher","Dublin Core:Date","Dublin Core:Contributor","Dublin Core:Rights","Dublin Core:Relation","Dublin Core:Format","Dublin Core:Language","Dublin Core:Type","Dublin Core:Identifier","Dublin Core:Coverage","Item Type Metadata:Text","Item Type Metadata:Interviewer","Item Type Metadata:Interviewee","Item Type Metadata:Location","Item Type Metadata:Transcription","Item Type Metadata:Local URL","Item Type Metadata:Original Format","Item Type Metadata:Physical Dimensions","Item Type Metadata:Duration","Item Type Metadata:Compression","Item Type Metadata:Producer","Item Type Metadata:Director","Item Type Metadata:Bit Rate/Frequency","Item Type Metadata:Time Summary","Item Type Metadata:Email Body","Item Type Metadata:Subject Line","Item Type Metadata:From","Item Type Metadata:To","Item Type Metadata:CC","Item Type Metadata:BCC","Item Type Metadata:Number of Attachments","Item Type Metadata:Standards","Item Type Metadata:Objectives","Item Type Metadata:Materials","Item Type Metadata:Lesson Plan Text","Item Type Metadata:URL","Item Type Metadata:Event Type","Item Type Metadata:Participants","Item Type Metadata:Birth Date","Item Type Metadata:Birthplace","Item Type Metadata:Death Date","Item Type Metadata:Occupation","Item Type Metadata:Biographical Text","Item Type Metadata:Bibliography","Item Type Metadata:Player","Item Type Metadata:Episode","Item Type Metadata:Season","Item Type Metadata:Episode Type","Item Type Metadata:Explicit","Item Type Metadata:Block","PDF Text:Text",tags,file,itemType,collection,public,featured
2941,https://omeka.lib.jmu.edu/erp/items/show/2941,,,,,,,,,,,,,,,,,,,,,,,,,,,,,,,,,,,,,,,,,"Commonwealth v. Saylor Crist and William Hinegardner","Misdemeanor^^Indictment^^Ford Touring Car^^Federal agent","Misdemeanor; Indictment",,"Rockingham County Circuit Court ","JMU Libraries",1924,"Craig Schaefer, Kayla Heslin, Selena St. Andre","This work has been identified as being free of known restrictions under copyright law, including all related and neighboring rights. (<a href=""https://creativecommons.org/publicdomain/mark/1.0/"" target=""_blank"" rel=""noreferrer noopener"">https://creativecommons.org/publicdomain/mark/1.0/</a>)",,PDF,,,RcPr-box4-002,,,,,,,,,,,,,,,,,,,,,,,,,,,,,,,,,,,,,,,,,,,"Crist,Hinegardner",https://omeka.lib.jmu.edu/erp/files/original/b2ce10df022fdab182fc603c9de93803.pdf,Text,"Rockingham County Prohibition Records: Criminal Cases",1,0
2751,https://omeka.lib.jmu.edu/erp/items/show/2751,,,,,,,,,,,,,,,,,,,,,,,,,,,,,,,,,,,,,,,,,"Commonwealth v. Scott H. Barber","misdemeanor^^guilty^^Received whiskey from Southern Express Company","Misdemeanor; Guilty",,"Rockingham County Circuit Court ","JMU Libraries",1917,"Craig Schaefer, Kayla Heslin, Selena St. Andre","This work has been identified as being free of known restrictions under copyright law, including all related and neighboring rights. (<a href=""https://creativecommons.org/publicdomain/mark/1.0/"" target=""_blank"" rel=""noreferrer noopener"">https://creativecommons.org/publicdomain/mark/1.0/</a>)",,"PDF ",,,RcPr-box1-012,,,,,,,,,,,,,,,,,,,,,,,,,,,,,,,,,,,,,,,,,,,Barber,https://omeka.lib.jmu.edu/erp/files/original/d09f58e1b36eb2e4e96211bf5a969a60.pdf,Text,"Rockingham County Prohibition Records: Criminal Cases",1,0
6462,https://omeka.lib.jmu.edu/erp/items/show/6462,,,,,,,,,,,,,,,,,,,,,,,,,,,,,,,,,,,,,,,,,"Commonwealth v. Scott Heese","Misdemeanor^^Sale of Alcohol","Defendant charged with misdemeanor sale of alcohol.","Rockingham County Criminal Court",,"JMU Libraries",1901,"Jennifer Taylor","This work has been identified as being free of known restrictions under copyright law, including all related and neighboring rights.<br /><a href=""https://creativecommons.org/publicdomain/mark/1.0/"" target=""_blank"" rel=""noreferrer noopener"">https://creativecommons.org/publicdomain/mark/1.0/</a>",,PDF,,,CCR001_003_023,,,,,,,,,,,,,,,,,,,,,,,,,,,,,,,,,,,,,,,,,,,"Heese,Long",https://omeka.lib.jmu.edu/erp/files/original/Rockingham_County_Criminal_Court_Criminal_Cases/ccr001_003_023-commonwealth-v-scott-heese.pdf,Text,"Rockingham County Criminal Court: Criminal Cases",1,1
2824,https://omeka.lib.jmu.edu/erp/items/show/2824,,,,,,,,,,,,,,,,,,,,,,,,,,,,,,,,,,,,,,,,,"Commonwealth v. Selden Lam","Misdemeanor^^guilty^^State Normal Chem Analysis^^manufacture^^sell","Misdemeanor; Guilty",,"Rockingham County Circuit Court ","JMU Libraries",1921,"Craig Schaefer, Kayla Heslin, Selena St. Andre","This work has been identified as being free of known restrictions under copyright law, including all related and neighboring rights. (<a href=""https://creativecommons.org/publicdomain/mark/1.0/"" target=""_blank"" rel=""noreferrer noopener"">https://creativecommons.org/publicdomain/mark/1.0/</a>)",,"PDF ",,,RcPr-box2-005,,,,,,,,,,,,,,,,,,,,,,,,,,,,,,,,,,,,,,,,,,,Lam,https://omeka.lib.jmu.edu/erp/files/original/d8425c4817727987d3ae55a93afe7181.pdf,Text,"Rockingham County Prohibition Records: Criminal Cases",1,0
8353,https://omeka.lib.jmu.edu/erp/items/show/8353,,,,,,,,,,,,,,,,,,,,,,,,,,,,,,,,,,,,,,,,,"Commonwealth v. Shade Knight","Felony^^Break and Enter^^Larceny","Defendant charged with felony break and enter and felony larceny.",,,"JMU LIbraries",1899,"Jennifer Taylor","This work has been identified as being free of known restrictions under copyright law, including all related and neighboring rights.<br /><a href=""https://creativecommons.org/publicdomain/mark/1.0/"" target=""_blank"" rel=""noreferrer noopener"">https://creativecommons.org/publicdomain/mark/1.0/</a>",,PDF,,,CCR001_002_044,,,,,,,,,,,,,,,,,,,,,,,,,,,,,,,,,,,,,,,,,,,"Knight,Weast",https://omeka.lib.jmu.edu/erp/files/original/Rockingham_County_Criminal_Court_Criminal_Cases/ccr001_002_044-commonwealth-v-shade-knight.pdf,Text,"Rockingham County Criminal Court: Criminal Cases",1,0
3263,https://omeka.lib.jmu.edu/erp/items/show/3263,,,,,,,,,,,,,,,,,,,,,,,,,,,,,,,,,,,,,,,,,"Commonwealth v. Sheffey Meyers","Misdemeanor^^Indictment^^posession of ardent spirits","Misdemeanor; Indictment",,"Rockingham County Circuit Court ","JMU Libraries",1930,"Craig Schaefer, Kayla Heslin, Selena St. Andre","This work has been identified as being free of known restrictions under copyright law, including all related and neighboring rights. (<a href=""https://creativecommons.org/publicdomain/mark/1.0/"" target=""_blank"" rel=""noreferrer noopener"">https://creativecommons.org/publicdomain/mark/1.0/</a>)",,PDF,,,RcPr-box8-071,,,,,,,,,,,,,,,,,,,,,,,,,,,,,,,,,,,,,,,,,,,Myers,https://omeka.lib.jmu.edu/erp/files/original/53b45d3df007de6c3896658dd0192f0a.pdf,Text,"Rockingham County Prohibition Records: Criminal Cases",1,0
2971,https://omeka.lib.jmu.edu/erp/items/show/2971,,,,,,,,,,,,,,,,,,,,,,,,,,,,,,,,,,,,,,,,,"Commonwealth v. Silas Nicholas and Kenton Madden",Misdemeanor^^Indictment,"Misdemeanor; Indictment",,"Rockingham County Circuit Court ","JMU Libraries",1924,"Craig Schaefer, Kayla Heslin, Selena St. Andre","This work has been identified as being free of known restrictions under copyright law, including all related and neighboring rights. (<a href=""https://creativecommons.org/publicdomain/mark/1.0/"" target=""_blank"" rel=""noreferrer noopener"">https://creativecommons.org/publicdomain/mark/1.0/</a>)",,PDF,,,RcPr-box4-032,,,,,,,,,,,,,,,,,,,,,,,,,,,,,,,,,,,,,,,,,,,"Madden,Nicholas",https://omeka.lib.jmu.edu/erp/files/original/86bf6da101759b86ace93e467b7cd53d.pdf,Text,"Rockingham County Prohibition Records: Criminal Cases",1,0
2909,https://omeka.lib.jmu.edu/erp/items/show/2909,,,,,,,,,,,,,,,,,,,,,,,,,,,,,,,,,,,,,,,,,"Commonwealth v. Silas Nicolas ","Misdemeanor^^Indictment^^Ford Touring Car","Misdemeanor; Indictment",,"Rockingham County Circuit Court ","JMU Libraries",1923,"Craig Schaefer, Kayla Heslin, Selena St. Andre","This work has been identified as being free of known restrictions under copyright law, including all related and neighboring rights. (<a href=""https://creativecommons.org/publicdomain/mark/1.0/"" target=""_blank"" rel=""noreferrer noopener"">https://creativecommons.org/publicdomain/mark/1.0/</a>)",,PDF,,,RcPr-box3-033,,,,,,,,,,,,,,,,,,,,,,,,,,,,,,,,,,,,,,,,,,,Nicholas,https://omeka.lib.jmu.edu/erp/files/original/a690f21f8f786137dde299d7f7f32912.pdf,Text,"Rockingham County Prohibition Records: Criminal Cases",1,0
3026,https://omeka.lib.jmu.edu/erp/items/show/3026,,,,,,,,,,,,,,,,,,,,,,,,,,,,,,,,,,,,,,,,,"Commonwealth v. Silas Shifflett",Misdemeanor^^Indictment,"Misdemeanor; Indictment",,"Rockingham County Circuit Court ","JMU Libraries",1925,"Craig Schaefer, Kayla Heslin, Selena St. Andre","This work has been identified as being free of known restrictions under copyright law, including all related and neighboring rights. (<a href=""https://creativecommons.org/publicdomain/mark/1.0/"" target=""_blank"" rel=""noreferrer noopener"">https://creativecommons.org/publicdomain/mark/1.0/</a>)",,"PDF ",,,RcPr-box5-028,,,,,,,,,,,,,,,,,,,,,,,,,,,,,,,,,,,,,,,,,,,Shifflett,https://omeka.lib.jmu.edu/erp/files/original/e4cd8b5caff68b521af51ee1955cc146.pdf,Text,"Rockingham County Prohibition Records: Criminal Cases",1,0
2996,https://omeka.lib.jmu.edu/erp/items/show/2996,,,,,,,,,,,,,,,,,,,,,,,,,,,,,,,,,,,,,,,,,"Commonwealth v. Silas Williams",Misdemeanor^^Indictment,"Misdemeanor; Indictment",,"Rockingham County Circuit Court ","JMU Libraries",1924,"Craig Schaefer, Kayla Heslin, Selena St. Andre","This work has been identified as being free of known restrictions under copyright law, including all related and neighboring rights. (<a href=""https://creativecommons.org/publicdomain/mark/1.0/"" target=""_blank"" rel=""noreferrer noopener"">https://creativecommons.org/publicdomain/mark/1.0/</a>)",,PDF,,,RcPr-box4-057,,,,,,,,,,,,,,,,,,,,,,,,,,,,,,,,,,,,,,,,,,,Williams,https://omeka.lib.jmu.edu/erp/files/original/330bc99be16fcce67528032f7073109d.pdf,Text,"Rockingham County Prohibition Records: Criminal Cases",1,0
2997,https://omeka.lib.jmu.edu/erp/items/show/2997,,,,,,,,,,,,,,,,,,,,,,,,,,,,,,,,,,,,,,,,,"Commonwealth v. Silas Williams","Felony^^not guilty^^posession of still^^Still","Felony; Not Guilty",,"Rockingham County Circuit Court ","JMU Libraries",1924,"Craig Schaefer, Kayla Heslin, Selena St. Andre","This work has been identified as being free of known restrictions under copyright law, including all related and neighboring rights. (<a href=""https://creativecommons.org/publicdomain/mark/1.0/"" target=""_blank"" rel=""noreferrer noopener"">https://creativecommons.org/publicdomain/mark/1.0/</a>)",,PDF,,,RcPr-box4-058,,,,,,,,,,,,,,,,,,,,,,,,,,,,,,,,,,,,,,,,,,,Williams,https://omeka.lib.jmu.edu/erp/files/original/e438def332525513f7065fba55e81095.pdf,Text,"Rockingham County Prohibition Records: Criminal Cases",1,0
2767,https://omeka.lib.jmu.edu/erp/items/show/2767,,,,,,,,,,,,,,,,,,,,,,,,,,,,,,,,,,,,,,,,,"Commonwealth v. Solomon Smith",,,,"Rockingham County Circuit Court ","JMU Libraries",1917,"Craig Schaefer, Kayla Heslin, Selena St. Andre","This work has been identified as being free of known restrictions under copyright law, including all related and neighboring rights. (<a href=""https://creativecommons.org/publicdomain/mark/1.0/"" target=""_blank"" rel=""noreferrer noopener"">https://creativecommons.org/publicdomain/mark/1.0/</a>)",,"PDF ",,,RcPr-box1-028,,,,,,,,,,,,,,,,,,,,,,,,,,,,,,,,,,,,,,,,,,,Smith,https://omeka.lib.jmu.edu/erp/files/original/8eb42e1d29a6b346b58b1c194e4b4e62.pdf,Text,"Rockingham County Prohibition Records: Criminal Cases",1,0
2784,https://omeka.lib.jmu.edu/erp/items/show/2784,,,,,,,,,,,,,,,,,,,,,,,,,,,,,,,,,,,,,,,,,"Commonwealth v. Solomon Smith",,,,"Rockingham County Circuit Court ","JMU Libraries",1918,"Craig Schaefer, Kayla Heslin, Selena St. Andre","This work has been identified as being free of known restrictions under copyright law, including all related and neighboring rights. (<a href=""https://creativecommons.org/publicdomain/mark/1.0/"" target=""_blank"" rel=""noreferrer noopener"">https://creativecommons.org/publicdomain/mark/1.0/</a>)",,"PDF ",,,RcPr-box1-045,,,,,,,,,,,,,,,,,,,,,,,,,,,,,,,,,,,,,,,,,,,Smith,https://omeka.lib.jmu.edu/erp/files/original/b0d7e9491d4aa8503eb342194a11727a.pdf,Text,"Rockingham County Prohibition Records: Criminal Cases",1,0
3193,https://omeka.lib.jmu.edu/erp/items/show/3193,,,,,,,,,,,,,,,,,,,,,,,,,,,,,,,,,,,,,,,,,"Commonwealth v. Stella Lam","Misdemeanor^^Indictment^^posession ardent spirits","Misdemeanor; Indictment",,"Rockingham County Circuit Court ","JMU Libraries",1929,"Craig Schaefer, Kayla Heslin, Selena St. Andre","This work has been identified as being free of known restrictions under copyright law, including all related and neighboring rights. (<a href=""https://creativecommons.org/publicdomain/mark/1.0/"" target=""_blank"" rel=""noreferrer noopener"">https://creativecommons.org/publicdomain/mark/1.0/</a>)",,PDF,,,RcPr-box8-001,,,,,,,,,,,,,,,,,,,,,,,,,,,,,,,,,,,,,,,,,,,Lam,https://omeka.lib.jmu.edu/erp/files/original/83da75689a4eb750d4fbddafc557120c.pdf,Text,"Rockingham County Prohibition Records: Criminal Cases",1,0
6461,https://omeka.lib.jmu.edu/erp/items/show/6461,,,,,,,,,,,,,,,,,,,,,,,,,,,,,,,,,,,,,,,,,"Commonwealth v. Stephen Gaines",Felony^^Theft,"Defendant charged with felony theft.","Rockingham County Criminal Court",,"JMU Libraries",1909,"Jennifer Taylor","This work has been identified as being free of known restrictions under copyright law, including all related and neighboring rights.<br /><a href=""https://creativecommons.org/publicdomain/mark/1.0/"" target=""_blank"" rel=""noreferrer noopener"">https://creativecommons.org/publicdomain/mark/1.0/</a>",,PDF,,,CCR001_005_141,,,,,,,,,,,,,,,,,,,,,,,,,,,,,,,,,,,,,,,,,,,"Alexander,Gaines",https://omeka.lib.jmu.edu/erp/files/original/Rockingham_County_Criminal_Court_Criminal_Cases/ccr001_005_141-commonwealth-v-stephen-gaines.pdf,Text,"Rockingham County Criminal Court: Criminal Cases",1,1
2821,https://omeka.lib.jmu.edu/erp/items/show/2821,,,,,,,,,,,,,,,,,,,,,,,,,,,,,,,,,,,,,,,,,"Commonwealth v. Stuart Grim and Nora Grim",Misdemeanor^^guilty,"Misdemeanor; Guilty",,"Rockingham County Circuit Court ","JMU Libraries",1921,"Craig Schaefer, Kayla Heslin, Selena St. Andre","This work has been identified as being free of known restrictions under copyright law, including all related and neighboring rights. (<a href=""https://creativecommons.org/publicdomain/mark/1.0/"" target=""_blank"" rel=""noreferrer noopener"">https://creativecommons.org/publicdomain/mark/1.0/</a>)",,"PDF ",,,RcPr-box2-003,,,,,,,,,,,,,,,,,,,,,,,,,,,,,,,,,,,,,,,,,,,Grim,https://omeka.lib.jmu.edu/erp/files/original/69893bd1cd99bb24f045091e713ab235.pdf,Text,"Rockingham County Prohibition Records: Criminal Cases",1,0
6460,https://omeka.lib.jmu.edu/erp/items/show/6460,,,,,,,,,,,,,,,,,,,,,,,,,,,,,,,,,,,,,,,,,"Commonwealth v. Susie Reynolds",Felony^^Theft,"Defendant charged with felony theft.","Rockingham County Criminal Court",,"JMU Libraries",1927,"Jennifer Taylor","This work has been identified as being free of known restrictions under copyright law, including all related and neighboring rights.<br /><a href=""https://creativecommons.org/publicdomain/mark/1.0/"" target=""_blank"" rel=""noreferrer noopener"">https://creativecommons.org/publicdomain/mark/1.0/</a>",,PDF,,,CCR001_009_298,,,,,,,,,,,,,,,,,,,,,,,,,,,,,,,,,,,,,,,,,,,Reynolds,https://omeka.lib.jmu.edu/erp/files/original/Rockingham_County_Criminal_Court_Criminal_Cases/ccr001_009_298-commonwealth-v-susie-reynolds.pdf,Text,"Rockingham County Criminal Court: Criminal Cases",1,1
8352,https://omeka.lib.jmu.edu/erp/items/show/8352,,,,,,,,,,,,,,,,,,,,,,,,,,,,,,,,,,,,,,,,,"Commonwealth v. Syran Hoover","Felony^^Attempted Murder^^Assault","Defendant charged with felony attempted murder and felony assault. ",,,"JMU LIbraries",1891,"Jennifer Taylor","This work has been identified as being free of known restrictions under copyright law, including all related and neighboring rights.<br /><a href=""https://creativecommons.org/publicdomain/mark/1.0/"" target=""_blank"" rel=""noreferrer noopener"">https://creativecommons.org/publicdomain/mark/1.0/</a>",,PDF,,,CCR001_001_048,,,,,,,,,,,,,,,,,,,,,,,,,,,,,,,,,,,,,,,,,,,"Hoover,Lawman",https://omeka.lib.jmu.edu/erp/files/original/Rockingham_County_Criminal_Court_Criminal_Cases/ccr001_001_048-commonwealth-v-syran-hoover.pdf,Text,"Rockingham County Criminal Court: Criminal Cases",1,0
2858,https://omeka.lib.jmu.edu/erp/items/show/2858,,,,,,,,,,,,,,,,,,,,,,,,,,,,,,,,,,,,,,,,,"Commonwealth v. T.B. Saunders and Bessie Moses","Misdemeanor^^guilty^^manufacture^^sell^^offer^^transport^^dispense^^advertise^^receive order for ardent spirits","Misdemeanor; Guilty",,"Rockingham County Circuit Court ","JMU Libraries",1922,"Craig Schaefer, Kayla Heslin, Selena St. Andre","This work has been identified as being free of known restrictions under copyright law, including all related and neighboring rights. (<a href=""https://creativecommons.org/publicdomain/mark/1.0/"" target=""_blank"" rel=""noreferrer noopener"">https://creativecommons.org/publicdomain/mark/1.0/</a>)",,"PDF ",,,RcPr-box2-039,,,,,,,,,,,,,,,,,,,,,,,,,,,,,,,,,,,,,,,,,,,"Moses,Saunders",https://omeka.lib.jmu.edu/erp/files/original/5685400fafcc4c4cb01b624706d45ff0.pdf,Text,"Rockingham County Prohibition Records: Criminal Cases",1,0
3201,https://omeka.lib.jmu.edu/erp/items/show/3201,,,,,,,,,,,,,,,,,,,,,,,,,,,,,,,,,,,,,,,,,"Commonwealth v. T.G. Ritchie","Misdemeanor^^Indictment^^operated an automobile under the influence","Misdemeanor; Indictment",,"Rockingham County Circuit Court ","JMU Libraries",1929,"Craig Schaefer, Kayla Heslin, Selena St. Andre","This work has been identified as being free of known restrictions under copyright law, including all related and neighboring rights. (<a href=""https://creativecommons.org/publicdomain/mark/1.0/"" target=""_blank"" rel=""noreferrer noopener"">https://creativecommons.org/publicdomain/mark/1.0/</a>)",,PDF,,,RcPr-box8-009,,,,,,,,,,,,,,,,,,,,,,,,,,,,,,,,,,,,,,,,,,,Ritchie,https://omeka.lib.jmu.edu/erp/files/original/b7db8ad45c35f5a7199ebc4f511cb8ad.pdf,Text,"Rockingham County Prohibition Records: Criminal Cases",1,0
