﻿"Item Id","Item URI","Dublin Core:Alternative Title","Dublin Core:Abstract","Dublin Core:Table Of Contents","Dublin Core:Date Available","Dublin Core:Date Created","Dublin Core:Date Accepted","Dublin Core:Date Copyrighted","Dublin Core:Date Submitted","Dublin Core:Date Issued","Dublin Core:Date Modified","Dublin Core:Date Valid","Dublin Core:Access Rights","Dublin Core:License","Dublin Core:Conforms To","Dublin Core:Has Format","Dublin Core:Has Part","Dublin Core:Has Version","Dublin Core:Is Format Of","Dublin Core:Is Part Of","Dublin Core:Is Referenced By","Dublin Core:Is Replaced By","Dublin Core:Is Required By","Dublin Core:Is Version Of","Dublin Core:References","Dublin Core:Replaces","Dublin Core:Requires","Dublin Core:Extent","Dublin Core:Medium","Dublin Core:Bibliographic Citation","Dublin Core:Spatial Coverage","Dublin Core:Temporal Coverage","Dublin Core:Accrual Method","Dublin Core:Accrual Periodicity","Dublin Core:Accrual Policy","Dublin Core:Audience","Dublin Core:Audience Education Level","Dublin Core:Mediator","Dublin Core:Instructional Method","Dublin Core:Provenance","Dublin Core:Rights Holder","Dublin Core:Title","Dublin Core:Subject","Dublin Core:Description","Dublin Core:Creator","Dublin Core:Source","Dublin Core:Publisher","Dublin Core:Date","Dublin Core:Contributor","Dublin Core:Rights","Dublin Core:Relation","Dublin Core:Format","Dublin Core:Language","Dublin Core:Type","Dublin Core:Identifier","Dublin Core:Coverage","Item Type Metadata:Text","Item Type Metadata:Interviewer","Item Type Metadata:Interviewee","Item Type Metadata:Location","Item Type Metadata:Transcription","Item Type Metadata:Local URL","Item Type Metadata:Original Format","Item Type Metadata:Physical Dimensions","Item Type Metadata:Duration","Item Type Metadata:Compression","Item Type Metadata:Producer","Item Type Metadata:Director","Item Type Metadata:Bit Rate/Frequency","Item Type Metadata:Time Summary","Item Type Metadata:Email Body","Item Type Metadata:Subject Line","Item Type Metadata:From","Item Type Metadata:To","Item Type Metadata:CC","Item Type Metadata:BCC","Item Type Metadata:Number of Attachments","Item Type Metadata:Standards","Item Type Metadata:Objectives","Item Type Metadata:Materials","Item Type Metadata:Lesson Plan Text","Item Type Metadata:URL","Item Type Metadata:Event Type","Item Type Metadata:Participants","Item Type Metadata:Birth Date","Item Type Metadata:Birthplace","Item Type Metadata:Death Date","Item Type Metadata:Occupation","Item Type Metadata:Biographical Text","Item Type Metadata:Bibliography","Item Type Metadata:Player","Item Type Metadata:Episode","Item Type Metadata:Season","Item Type Metadata:Episode Type","Item Type Metadata:Explicit","Item Type Metadata:Block","PDF Text:Text",tags,file,itemType,collection,public,featured
3060,https://omeka.lib.jmu.edu/erp/items/show/3060,,,,,,,,,,,,,,,,,,,,,,,,,,,,,,,,,,,,,,,,,"Commonwealth v. Michael Scott and Myrtle Scott","Misdemeanor^^guilty^^Operating a ""bawdy house""","Misdemeanor; Guilty",,"Rockingham County Circuit Court ","JMU Libraries",1926,"Craig Schaefer, Kayla Heslin, Selena St. Andre","This work has been identified as being free of known restrictions under copyright law, including all related and neighboring rights. (<a href=""https://creativecommons.org/publicdomain/mark/1.0/"" target=""_blank"" rel=""noreferrer noopener"">https://creativecommons.org/publicdomain/mark/1.0/</a>)",,"PDF ",,,RcPr-box6-006,,,,,,,,,,,,,,,,,,,,,,,,,,,,,,,,,,,,,,,,,,,Scott,https://omeka.lib.jmu.edu/erp/files/original/3e55689be336ff3e7d80dd157f89c3c2.pdf,Text,"Rockingham County Prohibition Records: Criminal Cases",1,0
2915,https://omeka.lib.jmu.edu/erp/items/show/2915,,,,,,,,,,,,,,,,,,,,,,,,,,,,,,,,,,,,,,,,,"Commonwealth v. Michael Scott, Myrtle Scott, and Silas Nicolas","Misdemeanor^^not guilty^^Political Cartoon^^Homestead Exemption","Misdemeanor; Not Guilty",,"Rockingham County Circuit Court ","JMU Libraries",1923,"Craig Schaefer, Kayla Heslin, Selena St. Andre","This work has been identified as being free of known restrictions under copyright law, including all related and neighboring rights. (<a href=""https://creativecommons.org/publicdomain/mark/1.0/"" target=""_blank"" rel=""noreferrer noopener"">https://creativecommons.org/publicdomain/mark/1.0/</a>)",,PDF,,,RcPr-box3-039,,,,,,,,,,,,,,,,,,,,,,,,,,,,,,,,,,,,,,,,,,,"Nicholas,Scott",https://omeka.lib.jmu.edu/erp/files/original/de778345b852f8c9ae4cca8be7ca38e9.pdf,Text,"Rockingham County Prohibition Records: Criminal Cases",1,0
3265,https://omeka.lib.jmu.edu/erp/items/show/3265,,,,,,,,,,,,,,,,,,,,,,,,,,,,,,,,,,,,,,,,,"Commonwealth v. Milford Pence","Misdemeanor^^Indictment^^sold ardent spirits-one pint","Misdemeanor; Indictment",,"Rockingham County Circuit Court ","JMU Libraries",1930,"Craig Schaefer, Kayla Heslin, Selena St. Andre","This work has been identified as being free of known restrictions under copyright law, including all related and neighboring rights. (<a href=""https://creativecommons.org/publicdomain/mark/1.0/"" target=""_blank"" rel=""noreferrer noopener"">https://creativecommons.org/publicdomain/mark/1.0/</a>)",,PDF,,,RcPr-box8-073,,,,,,,,,,,,,,,,,,,,,,,,,,,,,,,,,,,,,,,,,,,Pence,https://omeka.lib.jmu.edu/erp/files/original/ed50c01a8bf922b531f6d5987020a7ad.pdf,Text,"Rockingham County Prohibition Records: Criminal Cases",1,0
3239,https://omeka.lib.jmu.edu/erp/items/show/3239,,,,,,,,,,,,,,,,,,,,,,,,,,,,,,,,,,,,,,,,,"Commonwealth v. Milton Grim","Misdemeanor^^Indictment^^posession ardent spirits","Misdemeanor; Indictment",,"Rockingham County Circuit Court ","JMU Libraries",1930,"Craig Schaefer, Kayla Heslin, Selena St. Andre","This work has been identified as being free of known restrictions under copyright law, including all related and neighboring rights. (<a href=""https://creativecommons.org/publicdomain/mark/1.0/"" target=""_blank"" rel=""noreferrer noopener"">https://creativecommons.org/publicdomain/mark/1.0/</a>)",,PDF,,,RcPr-box8-047,,,,,,,,,,,,,,,,,,,,,,,,,,,,,,,,,,,,,,,,,,,Grim,https://omeka.lib.jmu.edu/erp/files/original/cc6db76c8372ea45b7f919d782aba3ed.pdf,Text,"Rockingham County Prohibition Records: Criminal Cases",1,0
6517,https://omeka.lib.jmu.edu/erp/items/show/6517,,,,,,,,,,,,,,,,,,,,,,,,,,,,,,,,,,,,,,,,,"Commonwealth v. Milton Grim","Felony^^Attempted Murder","Defendant charged with felony attempted murder.","Rockingham County Criminal Court",,"JMU Libraries",1923,"Jennifer Taylor","This work has been identified as being free of known restrictions under copyright law, including all related and neighboring rights.<br /><a href=""https://creativecommons.org/publicdomain/mark/1.0/"" target=""_blank"" rel=""noreferrer noopener"">https://creativecommons.org/publicdomain/mark/1.0/</a>",,PDF,,,CCR001_008_244,,,,,,,,,,,,,,,,,,,,,,,,,,,,,,,,,,,,,,,,,,,"Grimm,Lam,Mazingo",https://omeka.lib.jmu.edu/erp/files/original/Rockingham_County_Criminal_Court_Criminal_Cases/ccr001_008_244-commonwealth-v-milton-grim.pdf,Text,"Rockingham County Criminal Court: Criminal Cases",1,1
6516,https://omeka.lib.jmu.edu/erp/items/show/6516,,,,,,,,,,,,,,,,,,,,,,,,,,,,,,,,,,,,,,,,,"Commonwealth v. Minnie F. Knupp",Felony^^Adultery,"Defendant charged with felony adultery.","Rockingham County Criminal Court",,"JMU Libraries",1911,"Jennifer Taylor","This work has been identified as being free of known restrictions under copyright law, including all related and neighboring rights.<br /><a href=""https://creativecommons.org/publicdomain/mark/1.0/"" target=""_blank"" rel=""noreferrer noopener"">https://creativecommons.org/publicdomain/mark/1.0/</a>",,PDF,,,CCR001_006_183,,,,,,,,,,,,,,,,,,,,,,,,,,,,,,,,,,,,,,,,,,,Knupp,https://omeka.lib.jmu.edu/erp/files/original/Rockingham_County_Criminal_Court_Criminal_Cases/ccr001_006_183-commonwealth-v-minnie-f-knupp.pdf,Text,"Rockingham County Criminal Court: Criminal Cases",1,1
6515,https://omeka.lib.jmu.edu/erp/items/show/6515,,,,,,,,,,,,,,,,,,,,,,,,,,,,,,,,,,,,,,,,,"Commonwealth v. Minor Hilbert",Felony^^Assault,"Defendant charged with felony assault.","Rockingham County Criminal Court",,"JMU Libraries",1910,"Jennifer Taylor","This work has been identified as being free of known restrictions under copyright law, including all related and neighboring rights.<br /><a href=""https://creativecommons.org/publicdomain/mark/1.0/"" target=""_blank"" rel=""noreferrer noopener"">https://creativecommons.org/publicdomain/mark/1.0/</a>",,PDF,,,CCR001_006_163,,,,,,,,,,,,,,,,,,,,,,,,,,,,,,,,,,,,,,,,,,,"Hilbert,Miller",https://omeka.lib.jmu.edu/erp/files/original/Rockingham_County_Criminal_Court_Criminal_Cases/ccr001_006_163-commonwealth-v-minor-hilbert.pdf,Text,"Rockingham County Criminal Court: Criminal Cases",1,1
2857,https://omeka.lib.jmu.edu/erp/items/show/2857,,,,,,,,,,,,,,,,,,,,,,,,,,,,,,,,,,,,,,,,,"Commonwealth v. Minor Rumsey","Misdemeanor^^guilty^^posession of ardent spirits^^minor (19) when indicted","Misdemeanor; Guilty",,"Rockingham County Circuit Court ","JMU Libraries",1922,"Craig Schaefer, Kayla Heslin, Selena St. Andre","This work has been identified as being free of known restrictions under copyright law, including all related and neighboring rights. (<a href=""https://creativecommons.org/publicdomain/mark/1.0/"" target=""_blank"" rel=""noreferrer noopener"">https://creativecommons.org/publicdomain/mark/1.0/</a>)",,"PDF ",,,RcPr-box2-038,,,,,,,,,,,,,,,,,,,,,,,,,,,,,,,,,,,,,,,,,,,Rumsey,https://omeka.lib.jmu.edu/erp/files/original/fe84b94e19db926efcb1d7f93c679cad.pdf,Text,"Rockingham County Prohibition Records: Criminal Cases",1,0
3257,https://omeka.lib.jmu.edu/erp/items/show/3257,,,,,,,,,,,,,,,,,,,,,,,,,,,,,,,,,,,,,,,,,"Commonwealth v. Mit Morris","Misdemeanor^^guilty^^posession ardent spirits","Misdemeanor; Guilty",,"Rockingham County Circuit Court ","JMU Libraries",1930,"Craig Schaefer, Kayla Heslin, Selena St. Andre","This work has been identified as being free of known restrictions under copyright law, including all related and neighboring rights. (<a href=""https://creativecommons.org/publicdomain/mark/1.0/"" target=""_blank"" rel=""noreferrer noopener"">https://creativecommons.org/publicdomain/mark/1.0/</a>)",,PDF,,,RcPr-box8-065,,,,,,,,,,,,,,,,,,,,,,,,,,,,,,,,,,,,,,,,,,,Morris,https://omeka.lib.jmu.edu/erp/files/original/36d8b9d47cb0f366fe6fa01e931def33.pdf,Text,"Rockingham County Prohibition Records: Criminal Cases",1,0
6513,https://omeka.lib.jmu.edu/erp/items/show/6513,,,,,,,,,,,,,,,,,,,,,,,,,,,,,,,,,,,,,,,,,"Commonwealth v. Moffet Butler",Felony^^Theft,"Defendant charged with felony theft.","Rockingham County Criminal Court",,"JMU Libraries",1905,"Jennifer Taylor","This work has been identified as being free of known restrictions under copyright law, including all related and neighboring rights.<br /><a href=""https://creativecommons.org/publicdomain/mark/1.0/"" target=""_blank"" rel=""noreferrer noopener"">https://creativecommons.org/publicdomain/mark/1.0/</a>",,PDF,,,CCR001_004_051,,,,,,,,,,,,,,,,,,,,,,,,,,,,,,,,,,,,,,,,,,,"Butler,Hoover",https://omeka.lib.jmu.edu/erp/files/original/Rockingham_County_Criminal_Court_Criminal_Cases/ccr001_004_051-commonwealth-v-moffet-butler.pdf,Text,"Rockingham County Criminal Court: Criminal Cases",1,1
6514,https://omeka.lib.jmu.edu/erp/items/show/6514,,,,,,,,,,,,,,,,,,,,,,,,,,,,,,,,,,,,,,,,,"Commonwealth v. Moffet Butler",Felony^^Perjury,"Defendant charged with felony perjury.","Rockingham County Criminal Court",,"JMU Libraries",1905,"Jennifer Taylor","This work has been identified as being free of known restrictions under copyright law, including all related and neighboring rights.<br /><a href=""https://creativecommons.org/publicdomain/mark/1.0/"" target=""_blank"" rel=""noreferrer noopener"">https://creativecommons.org/publicdomain/mark/1.0/</a>",,PDF,,,CCR001_004_052,,,,,,,,,,,,,,,,,,,,,,,,,,,,,,,,,,,,,,,,,,,Butler,https://omeka.lib.jmu.edu/erp/files/original/Rockingham_County_Criminal_Court_Criminal_Cases/ccr001_004_052-commonwealth-v-moffet-butler.pdf,Text,"Rockingham County Criminal Court: Criminal Cases",1,1
8376,https://omeka.lib.jmu.edu/erp/items/show/8376,,,,,,,,,,,,,,,,,,,,,,,,,,,,,,,,,,,,,,,,,"Commonwealth v. Moffet Cochran","Misdemeanor^^Sale of Alcohol","Defendant charged with misdemeanor sale of alcohol.",,,"JMU LIbraries",1894,"Jennifer Taylor","This work has been identified as being free of known restrictions under copyright law, including all related and neighboring rights.<br /><a href=""https://creativecommons.org/publicdomain/mark/1.0/"" target=""_blank"" rel=""noreferrer noopener"">https://creativecommons.org/publicdomain/mark/1.0/</a>",,PDF,,,CCR001_002_011,,,,,,,,,,,,,,,,,,,,,,,,,,,,,,,,,,,,,,,,,,,Cochran,https://omeka.lib.jmu.edu/erp/files/original/Rockingham_County_Criminal_Court_Criminal_Cases/ccr001_002_011-commonwealth-v-moffet-cochran.pdf,Text,"Rockingham County Criminal Court: Criminal Cases",1,0
6512,https://omeka.lib.jmu.edu/erp/items/show/6512,,,,,,,,,,,,,,,,,,,,,,,,,,,,,,,,,,,,,,,,,"Commonwealth v. Mohler Kite",Felony^^Rape^^Sodomy,"Defendant charged with felony rape and felony sodomy.","Rockingham County Criminal Court",,"JMU Libraries",1921,"Jennifer Taylor","This work has been identified as being free of known restrictions under copyright law, including all related and neighboring rights.<br /><a href=""https://creativecommons.org/publicdomain/mark/1.0/"" target=""_blank"" rel=""noreferrer noopener"">https://creativecommons.org/publicdomain/mark/1.0/</a>",,PDF,,,CCR001_007_229,,,,,,,,,,,,,,,,,,,,,,,,,,,,,,,,,,,,,,,,,,,"Coughlin,Kite",https://omeka.lib.jmu.edu/erp/files/original/Rockingham_County_Criminal_Court_Criminal_Cases/ccr001_007_229-commonwealth-v-mohler-kite.pdf,Text,"Rockingham County Criminal Court: Criminal Cases",1,1
8375,https://omeka.lib.jmu.edu/erp/items/show/8375,,,,,,,,,,,,,,,,,,,,,,,,,,,,,,,,,,,,,,,,,"Commonwealth v. Montgomery Marshall","Felony^^Attempted Murder","Defendant charged with felony attempted murder. ",,,"JMU LIbraries",1892,"Jennifer Taylor","This work has been identified as being free of known restrictions under copyright law, including all related and neighboring rights.<br /><a href=""https://creativecommons.org/publicdomain/mark/1.0/"" target=""_blank"" rel=""noreferrer noopener"">https://creativecommons.org/publicdomain/mark/1.0/</a>",,PDF,,,CCR001_001_068,,,,,,,,,,,,,,,,,,,,,,,,,,,,,,,,,,,,,,,,,,,"Baugher,Marshall",https://omeka.lib.jmu.edu/erp/files/original/Rockingham_County_Criminal_Court_Criminal_Cases/ccr001_001_068-commonwealth-v-montgomery-marshall.pdf,Text,"Rockingham County Criminal Court: Criminal Cases",1,0
6511,https://omeka.lib.jmu.edu/erp/items/show/6511,,,,,,,,,,,,,,,,,,,,,,,,,,,,,,,,,,,,,,,,,"Commonwealth v. Morgan H. Driver",Felony^^Fraud,"Defendant charged with felony fraud.","Rockingham County Criminal Court",,"JMU Libraries",1901,"Jennifer Taylor","This work has been identified as being free of known restrictions under copyright law, including all related and neighboring rights.<br /><a href=""https://creativecommons.org/publicdomain/mark/1.0/"" target=""_blank"" rel=""noreferrer noopener"">https://creativecommons.org/publicdomain/mark/1.0/</a>",,PDF,,,CCR001_003_019,,,,,,,,,,,,,,,,,,,,,,,,,,,,,,,,,,,,,,,,,,,"Driver,Leurs,McCall",https://omeka.lib.jmu.edu/erp/files/original/Rockingham_County_Criminal_Court_Criminal_Cases/ccr001_003_019-commonwealth-v-morgan-h-driver.pdf,Text,"Rockingham County Criminal Court: Criminal Cases",1,1
6510,https://omeka.lib.jmu.edu/erp/items/show/6510,,,,,,,,,,,,,,,,,,,,,,,,,,,,,,,,,,,,,,,,,"Commonwealth v. Moses Banks","Felony^^Attempted Murder","Defendant charged with felony attempted murder.","Rockingham County Criminal Court",,"JMU Libraries",1909,"Jennifer Taylor","This work has been identified as being free of known restrictions under copyright law, including all related and neighboring rights.<br /><a href=""https://creativecommons.org/publicdomain/mark/1.0/"" target=""_blank"" rel=""noreferrer noopener"">https://creativecommons.org/publicdomain/mark/1.0/</a>",,PDF,,,CCR001_005_135,,,,,,,,,,,,,,,,,,,,,,,,,,,,,,,,,,,,,,,,,,,"Banks,Davis",https://omeka.lib.jmu.edu/erp/files/original/Rockingham_County_Criminal_Court_Criminal_Cases/ccr001_005_135-commonwealth-v-moses-banks.pdf,Text,"Rockingham County Criminal Court: Criminal Cases",1,1
6508,https://omeka.lib.jmu.edu/erp/items/show/6508,,,,,,,,,,,,,,,,,,,,,,,,,,,,,,,,,,,,,,,,,"Commonwealth v. Moses Coleman","Felony^^Burglary^^Break and Enter^^Larceny","Defendant charged with felony break and enter and felony larceny.","Rockingham County Criminal Court",,"JMU Libraries",1900,"Jennifer Taylor","This work has been identified as being free of known restrictions under copyright law, including all related and neighboring rights.<br /><a href=""https://creativecommons.org/publicdomain/mark/1.0/"" target=""_blank"" rel=""noreferrer noopener"">https://creativecommons.org/publicdomain/mark/1.0/</a>",,PDF,,,CCR001_003_004,,,,,,,,,,,,,,,,,,,,,,,,,,,,,,,,,,,,,,,,,,,"Coleman,Karicofe,Sandy",https://omeka.lib.jmu.edu/erp/files/original/Rockingham_County_Criminal_Court_Criminal_Cases/ccr001_003_004-commonwealth-v-moses-coleman.pdf,Text,"Rockingham County Criminal Court: Criminal Cases",1,1
6509,https://omeka.lib.jmu.edu/erp/items/show/6509,,,,,,,,,,,,,,,,,,,,,,,,,,,,,,,,,,,,,,,,,"Commonwealth v. Moses Coleman","Felony^^Burglary^^Break and Enter^^Larceny","Defendant charged with felony break and enter and felony larceny.","Rockingham County Criminal Court",,"JMU Libraries",1920,"Jennifer Taylor","This work has been identified as being free of known restrictions under copyright law, including all related and neighboring rights.<br /><a href=""https://creativecommons.org/publicdomain/mark/1.0/"" target=""_blank"" rel=""noreferrer noopener"">https://creativecommons.org/publicdomain/mark/1.0/</a>",,PDF,,,CCR001_007_222,,,,,,,,,,,,,,,,,,,,,,,,,,,,,,,,,,,,,,,,,,,"Coleman,Karicofe",https://omeka.lib.jmu.edu/erp/files/original/Rockingham_County_Criminal_Court_Criminal_Cases/ccr001_007_222-commonwealth-v-moses-coleman.pdf,Text,"Rockingham County Criminal Court: Criminal Cases",1,1
13240,https://omeka.lib.jmu.edu/erp/items/show/13240,,,,,,,,,,,,,,,,,,,,,,,,,,,,,,,,,,,,,,,,,"Commonwealth v. Moses Cummins","Assault and Beating","Defendant charged with assault and beating. ","Rockingham County Circuit Court",,"JMU Libraries",1820,"Sydney Ring^^Megan Pullen","This work has been identified as being free of known restrictions under copyright law, including all related and neighboring rights. https://creativecommons.org/publicdomain/mark/1.0/",,PDF,,Criminal,Ccr002_007_019,,,,,,,,,,,,,,,,,,,,,,,,,,,,,,,,,,,,,,,,,,,"Cummins,Loker",https://omeka.lib.jmu.edu/erp/files/original/Rockingham_County_Criminal_Court_Criminal_Cases/Ccr002_007_019.pdf,Text,"Rockingham County Criminal Court: Criminal Cases",1,0
2955,https://omeka.lib.jmu.edu/erp/items/show/2955,,,,,,,,,,,,,,,,,,,,,,,,,,,,,,,,,,,,,,,,,"Commonwealth v. Moses Hawse and Charles Spellman","Misdemeanor^^Indictment^^Ford Touring Car^^Valley Turnpike","Misdemeanor; Indictment",,"Rockingham County Circuit Court ","JMU Libraries",1924,"Craig Schaefer, Kayla Heslin, Selena St. Andre","This work has been identified as being free of known restrictions under copyright law, including all related and neighboring rights. (<a href=""https://creativecommons.org/publicdomain/mark/1.0/"" target=""_blank"" rel=""noreferrer noopener"">https://creativecommons.org/publicdomain/mark/1.0/</a>)",,PDF,,,RcPr-box4-016,,,,,,,,,,,,,,,,,,,,,,,,,,,,,,,,,,,,,,,,,,,"Hawse,Spellman",https://omeka.lib.jmu.edu/erp/files/original/f25a011e012ce52c5274fe3b99208137.pdf,Text,"Rockingham County Prohibition Records: Criminal Cases",1,0
