﻿"Item Id","Item URI","Dublin Core:Alternative Title","Dublin Core:Abstract","Dublin Core:Table Of Contents","Dublin Core:Date Available","Dublin Core:Date Created","Dublin Core:Date Accepted","Dublin Core:Date Copyrighted","Dublin Core:Date Submitted","Dublin Core:Date Issued","Dublin Core:Date Modified","Dublin Core:Date Valid","Dublin Core:Access Rights","Dublin Core:License","Dublin Core:Conforms To","Dublin Core:Has Format","Dublin Core:Has Part","Dublin Core:Has Version","Dublin Core:Is Format Of","Dublin Core:Is Part Of","Dublin Core:Is Referenced By","Dublin Core:Is Replaced By","Dublin Core:Is Required By","Dublin Core:Is Version Of","Dublin Core:References","Dublin Core:Replaces","Dublin Core:Requires","Dublin Core:Extent","Dublin Core:Medium","Dublin Core:Bibliographic Citation","Dublin Core:Spatial Coverage","Dublin Core:Temporal Coverage","Dublin Core:Accrual Method","Dublin Core:Accrual Periodicity","Dublin Core:Accrual Policy","Dublin Core:Audience","Dublin Core:Audience Education Level","Dublin Core:Mediator","Dublin Core:Instructional Method","Dublin Core:Provenance","Dublin Core:Rights Holder","Dublin Core:Title","Dublin Core:Subject","Dublin Core:Description","Dublin Core:Creator","Dublin Core:Source","Dublin Core:Publisher","Dublin Core:Date","Dublin Core:Contributor","Dublin Core:Rights","Dublin Core:Relation","Dublin Core:Format","Dublin Core:Language","Dublin Core:Type","Dublin Core:Identifier","Dublin Core:Coverage","Item Type Metadata:Text","Item Type Metadata:Interviewer","Item Type Metadata:Interviewee","Item Type Metadata:Location","Item Type Metadata:Transcription","Item Type Metadata:Local URL","Item Type Metadata:Original Format","Item Type Metadata:Physical Dimensions","Item Type Metadata:Duration","Item Type Metadata:Compression","Item Type Metadata:Producer","Item Type Metadata:Director","Item Type Metadata:Bit Rate/Frequency","Item Type Metadata:Time Summary","Item Type Metadata:Email Body","Item Type Metadata:Subject Line","Item Type Metadata:From","Item Type Metadata:To","Item Type Metadata:CC","Item Type Metadata:BCC","Item Type Metadata:Number of Attachments","Item Type Metadata:Standards","Item Type Metadata:Objectives","Item Type Metadata:Materials","Item Type Metadata:Lesson Plan Text","Item Type Metadata:URL","Item Type Metadata:Event Type","Item Type Metadata:Participants","Item Type Metadata:Birth Date","Item Type Metadata:Birthplace","Item Type Metadata:Death Date","Item Type Metadata:Occupation","Item Type Metadata:Biographical Text","Item Type Metadata:Bibliography","Item Type Metadata:Player","Item Type Metadata:Episode","Item Type Metadata:Season","Item Type Metadata:Episode Type","Item Type Metadata:Explicit","Item Type Metadata:Block","PDF Text:Text",tags,file,itemType,collection,public,featured
2971,https://omeka.lib.jmu.edu/erp/items/show/2971,,,,,,,,,,,,,,,,,,,,,,,,,,,,,,,,,,,,,,,,,"Commonwealth v. Silas Nicholas and Kenton Madden",Misdemeanor^^Indictment,"Misdemeanor; Indictment",,"Rockingham County Circuit Court ","JMU Libraries",1924,"Craig Schaefer, Kayla Heslin, Selena St. Andre","This work has been identified as being free of known restrictions under copyright law, including all related and neighboring rights. (<a href=""https://creativecommons.org/publicdomain/mark/1.0/"" target=""_blank"" rel=""noreferrer noopener"">https://creativecommons.org/publicdomain/mark/1.0/</a>)",,PDF,,,RcPr-box4-032,,,,,,,,,,,,,,,,,,,,,,,,,,,,,,,,,,,,,,,,,,,"Madden,Nicholas",https://omeka.lib.jmu.edu/erp/files/original/86bf6da101759b86ace93e467b7cd53d.pdf,Text,"Rockingham County Prohibition Records: Criminal Cases",1,0
2970,https://omeka.lib.jmu.edu/erp/items/show/2970,,,,,,,,,,,,,,,,,,,,,,,,,,,,,,,,,,,,,,,,,"Commonwealth v. George Nicholas","Felony^^guilty^^3 criminal counts","Felony; Guilty",,"Rockingham County Circuit Court ","JMU Libraries",1924,"Craig Schaefer, Kayla Heslin, Selena St. Andre","This work has been identified as being free of known restrictions under copyright law, including all related and neighboring rights. (<a href=""https://creativecommons.org/publicdomain/mark/1.0/"" target=""_blank"" rel=""noreferrer noopener"">https://creativecommons.org/publicdomain/mark/1.0/</a>)",,PDF,,,RcPr-box4-031,,,,,,,,,,,,,,,,,,,,,,,,,,,,,,,,,,,,,,,,,,,Nicholas,https://omeka.lib.jmu.edu/erp/files/original/134e5b92fb0045334f49681c9fb3188d.pdf,Text,"Rockingham County Prohibition Records: Criminal Cases",1,0
2915,https://omeka.lib.jmu.edu/erp/items/show/2915,,,,,,,,,,,,,,,,,,,,,,,,,,,,,,,,,,,,,,,,,"Commonwealth v. Michael Scott, Myrtle Scott, and Silas Nicolas","Misdemeanor^^not guilty^^Political Cartoon^^Homestead Exemption","Misdemeanor; Not Guilty",,"Rockingham County Circuit Court ","JMU Libraries",1923,"Craig Schaefer, Kayla Heslin, Selena St. Andre","This work has been identified as being free of known restrictions under copyright law, including all related and neighboring rights. (<a href=""https://creativecommons.org/publicdomain/mark/1.0/"" target=""_blank"" rel=""noreferrer noopener"">https://creativecommons.org/publicdomain/mark/1.0/</a>)",,PDF,,,RcPr-box3-039,,,,,,,,,,,,,,,,,,,,,,,,,,,,,,,,,,,,,,,,,,,"Nicholas,Scott",https://omeka.lib.jmu.edu/erp/files/original/de778345b852f8c9ae4cca8be7ca38e9.pdf,Text,"Rockingham County Prohibition Records: Criminal Cases",1,0
2909,https://omeka.lib.jmu.edu/erp/items/show/2909,,,,,,,,,,,,,,,,,,,,,,,,,,,,,,,,,,,,,,,,,"Commonwealth v. Silas Nicolas ","Misdemeanor^^Indictment^^Ford Touring Car","Misdemeanor; Indictment",,"Rockingham County Circuit Court ","JMU Libraries",1923,"Craig Schaefer, Kayla Heslin, Selena St. Andre","This work has been identified as being free of known restrictions under copyright law, including all related and neighboring rights. (<a href=""https://creativecommons.org/publicdomain/mark/1.0/"" target=""_blank"" rel=""noreferrer noopener"">https://creativecommons.org/publicdomain/mark/1.0/</a>)",,PDF,,,RcPr-box3-033,,,,,,,,,,,,,,,,,,,,,,,,,,,,,,,,,,,,,,,,,,,Nicholas,https://omeka.lib.jmu.edu/erp/files/original/a690f21f8f786137dde299d7f7f32912.pdf,Text,"Rockingham County Prohibition Records: Criminal Cases",1,0
2783,https://omeka.lib.jmu.edu/erp/items/show/2783,,,,,,,,,,,,,,,,,,,,,,,,,,,,,,,,,,,,,,,,,"Commonwealth v. George Nicholas",,,,"Rockingham County Circuit Court ","JMU Libraries",1918,"Craig Schaefer, Kayla Heslin, Selena St. Andre","This work has been identified as being free of known restrictions under copyright law, including all related and neighboring rights. (<a href=""https://creativecommons.org/publicdomain/mark/1.0/"" target=""_blank"" rel=""noreferrer noopener"">https://creativecommons.org/publicdomain/mark/1.0/</a>)",,"PDF ",,,RcPr-box1-044,,,,,,,,,,,,,,,,,,,,,,,,,,,,,,,,,,,,,,,,,,,Nicholas,https://omeka.lib.jmu.edu/erp/files/original/a2bea3cd479a86d40e46a80e0a4d5b15.pdf,Text,"Rockingham County Prohibition Records: Criminal Cases",1,0
537,https://omeka.lib.jmu.edu/erp/items/show/537,,,,,,,,,,,,,,,,,,,,,,,,,,,,,,,,,,,,,,,,,"Nicholas, Carrie T.",,"Location: Madison Run",,"Naylor, Cassie - Shifflett, Ahaz","Rockingham County Circuit Courthouse",,"Pake Davis, Tristan Nelson, Liana Bayne","This work has been identified as being free of known restrictions under copyright law, including all related and neighboring rights.&nbsp;(<a href=""https://creativecommons.org/publicdomain/mark/1.0/"" target=""_blank"" rel=""noreferrer"">https://creativecommons.org/publicdomain/mark/1.0/</a>)",,PDF,,,nicholas-carrie-t.pdf,"Tract(s): 298",,,,,,,,,,,,,,,,,,,,,,,,,,,,,,,,,,,,,,,,,,Nicholas,https://omeka.lib.jmu.edu/erp/files/original/feaaee5c57bcf346fc306e8e550724f9.pdf,Text,"Rockingham County SNP Records: Court Proceedings",1,0
536,https://omeka.lib.jmu.edu/erp/items/show/536,,,,,,,,,,,,,,,,,,,,,,,,,,,,,,,,,,,,,,,,,"Nicholas, F. L.",,"Location: Madison Run",,"Naylor, Cassie - Shifflett, Ahaz","Rockingham County Circuit Courthouse",,"Pake Davis, Tristan Nelson, Liana Bayne","This work has been identified as being free of known restrictions under copyright law, including all related and neighboring rights.&nbsp;(<a href=""https://creativecommons.org/publicdomain/mark/1.0/"" target=""_blank"" rel=""noreferrer"">https://creativecommons.org/publicdomain/mark/1.0/</a>)",,PDF,,,nicholas-f-l.pdf,"Tract(s): 292",,,,,,,,,,,,,,,,,,,,,,,,,,,,,,,,,,,,,,,,,,Nicholas,https://omeka.lib.jmu.edu/erp/files/original/6546c0fae830979bd5288d86ec50126d.pdf,Text,"Rockingham County SNP Records: Court Proceedings",1,0
8492,https://omeka.lib.jmu.edu/erp/items/show/8492,,,,,,,,,,,,,,,,,,,,,,,,,,,,,,,,,,,,,,,,,"Commonwealth v Willie Nicholas","Felony^^Felonious Assault","defendant charged with felonious assault","Rockingham County Circuit Court",,"JMU Libraries",1962,"Nara Holdaway","This work has been identified as being free of known restrictions under copyright law, including all related and neighboring rights.<br /><a href=""https://creativecommons.org/publicdomain/mark/1.0/"" target=""_blank"" rel=""noreferrer noopener"">https://creativecommons.org/publicdomain/mark/1.0/</a>",,PDF,,,Ccr001_020_016,,,,,,,,,,,,,,,,,,,,,,,,,,,,,,,,,,,,,,,,,,,Nicholas,https://omeka.lib.jmu.edu/erp/files/original/Rockingham_County_Criminal_Court_Criminal_Cases/ccr001_020_016_commonwealth-v-willie-nicholas.pdf,Text,"Rockingham County Criminal Court: Criminal Cases",1,0
