﻿"Item Id","Item URI","Dublin Core:Alternative Title","Dublin Core:Abstract","Dublin Core:Table Of Contents","Dublin Core:Date Available","Dublin Core:Date Created","Dublin Core:Date Accepted","Dublin Core:Date Copyrighted","Dublin Core:Date Submitted","Dublin Core:Date Issued","Dublin Core:Date Modified","Dublin Core:Date Valid","Dublin Core:Access Rights","Dublin Core:License","Dublin Core:Conforms To","Dublin Core:Has Format","Dublin Core:Has Part","Dublin Core:Has Version","Dublin Core:Is Format Of","Dublin Core:Is Part Of","Dublin Core:Is Referenced By","Dublin Core:Is Replaced By","Dublin Core:Is Required By","Dublin Core:Is Version Of","Dublin Core:References","Dublin Core:Replaces","Dublin Core:Requires","Dublin Core:Extent","Dublin Core:Medium","Dublin Core:Bibliographic Citation","Dublin Core:Spatial Coverage","Dublin Core:Temporal Coverage","Dublin Core:Accrual Method","Dublin Core:Accrual Periodicity","Dublin Core:Accrual Policy","Dublin Core:Audience","Dublin Core:Audience Education Level","Dublin Core:Mediator","Dublin Core:Instructional Method","Dublin Core:Provenance","Dublin Core:Rights Holder","Dublin Core:Title","Dublin Core:Subject","Dublin Core:Description","Dublin Core:Creator","Dublin Core:Source","Dublin Core:Publisher","Dublin Core:Date","Dublin Core:Contributor","Dublin Core:Rights","Dublin Core:Relation","Dublin Core:Format","Dublin Core:Language","Dublin Core:Type","Dublin Core:Identifier","Dublin Core:Coverage","Item Type Metadata:Text","Item Type Metadata:Interviewer","Item Type Metadata:Interviewee","Item Type Metadata:Location","Item Type Metadata:Transcription","Item Type Metadata:Local URL","Item Type Metadata:Original Format","Item Type Metadata:Physical Dimensions","Item Type Metadata:Duration","Item Type Metadata:Compression","Item Type Metadata:Producer","Item Type Metadata:Director","Item Type Metadata:Bit Rate/Frequency","Item Type Metadata:Time Summary","Item Type Metadata:Email Body","Item Type Metadata:Subject Line","Item Type Metadata:From","Item Type Metadata:To","Item Type Metadata:CC","Item Type Metadata:BCC","Item Type Metadata:Number of Attachments","Item Type Metadata:Standards","Item Type Metadata:Objectives","Item Type Metadata:Materials","Item Type Metadata:Lesson Plan Text","Item Type Metadata:URL","Item Type Metadata:Event Type","Item Type Metadata:Participants","Item Type Metadata:Birth Date","Item Type Metadata:Birthplace","Item Type Metadata:Death Date","Item Type Metadata:Occupation","Item Type Metadata:Biographical Text","Item Type Metadata:Bibliography","Item Type Metadata:Player","Item Type Metadata:Episode","Item Type Metadata:Season","Item Type Metadata:Episode Type","Item Type Metadata:Explicit","Item Type Metadata:Block","PDF Text:Text",tags,file,itemType,collection,public,featured
8550,https://omeka.lib.jmu.edu/erp/items/show/8550,,,,,,,,,,,,,,,,,,,,,,,,,,,,,,,,,,,,,,,,,"Commonwealth v Lawrence Dean and Floyd Shifflett","Felony^^Malicious Wounding","Defendant charged with felony malicious wounding","Rockingham County Circuit Court",,"JMU Libraries",1948,"Nara Holdaway","This work has been identified as being free of known restrictions under copyright law, including all related and neighboring rights.<br /><a href=""https://creativecommons.org/publicdomain/mark/1.0/"" target=""_blank"" rel=""noreferrer noopener"">https://creativecommons.org/publicdomain/mark/1.0/</a>",,PDF,,,Ccr001_015_002,,,,,,,,,,,,,,,,,,,,,,,,,,,,,,,,,,,,,,,,,,,"Dean,Shifflett",https://omeka.lib.jmu.edu/erp/files/original/Rockingham_County_Criminal_Court_Criminal_Cases/ccr001_015_002_commonwealth-v-lawrence-dean-and-floyd-shifflett.pdf,Text,"Rockingham County Criminal Court: Criminal Cases",1,0
8551,https://omeka.lib.jmu.edu/erp/items/show/8551,,,,,,,,,,,,,,,,,,,,,,,,,,,,,,,,,,,,,,,,,"Commonwealth v Lawrence Dean and Floyd Shifflett",Felony^^Assault,"Defendant charged with felony assault","Rockingham County Circuit Court",,"JMU Libraries",1949,"Nara Holdaway","This work has been identified as being free of known restrictions under copyright law, including all related and neighboring rights.<br /><a href=""https://creativecommons.org/publicdomain/mark/1.0/"" target=""_blank"" rel=""noreferrer noopener"">https://creativecommons.org/publicdomain/mark/1.0/</a>",,PDF,,,Ccr001_015_007,,,,,,,,,,,,,,,,,,,,,,,,,,,,,,,,,,,,,,,,,,,"Dean,Shifflett",https://omeka.lib.jmu.edu/erp/files/original/Rockingham_County_Criminal_Court_Criminal_Cases/ccr001_015_007_commonwealth-v-lawrence-dean-and-floyd-shifflett.pdf,Text,"Rockingham County Criminal Court: Criminal Cases",1,0
8502,https://omeka.lib.jmu.edu/erp/items/show/8502,,,,,,,,,,,,,,,,,,,,,,,,,,,,,,,,,,,,,,,,,"Commonwealth v Sheridan Dean",Felony^^Murder,"Defendant charged with felony murder","Rockingham County Circuit Court",,"JMU Libraries",1942,"Nara Holdaway","This work has been identified as being free of known restrictions under copyright law, including all related and neighboring rights.<br /><a href=""https://creativecommons.org/publicdomain/mark/1.0/"" target=""_blank"" rel=""noreferrer noopener"">https://creativecommons.org/publicdomain/mark/1.0/</a>",,PDF,,,Ccr001_014_004,,,,,,,,,,,,,,,,,,,,,,,,,,,,,,,,,,,,,,,,,,,Dean,https://omeka.lib.jmu.edu/erp/files/original/Rockingham_County_Criminal_Court_Criminal_Cases/ccr001_014_004_commonwealth-v-sheridan-dean.pdf,Text,"Rockingham County Criminal Court: Criminal Cases",1,0
2943,https://omeka.lib.jmu.edu/erp/items/show/2943,,,,,,,,,,,,,,,,,,,,,,,,,,,,,,,,,,,,,,,,,"Commonwealth v. Asbury Dean",Misdemeanor^^Indictment^^Still,"Misdemeanor; Indictment",,"Rockingham County Circuit Court ","JMU Libraries",1924,"Craig Schaefer, Kayla Heslin, Selena St. Andre","This work has been identified as being free of known restrictions under copyright law, including all related and neighboring rights. (<a href=""https://creativecommons.org/publicdomain/mark/1.0/"" target=""_blank"" rel=""noreferrer noopener"">https://creativecommons.org/publicdomain/mark/1.0/</a>)",,PDF,,,RcPr-box4-004,,,,,,,,,,,,,,,,,,,,,,,,,,,,,,,,,,,,,,,,,,,Dean,https://omeka.lib.jmu.edu/erp/files/original/799afde7ddf85b904962cdab47e0cd54.pdf,Text,"Rockingham County Prohibition Records: Criminal Cases",1,0
2961,https://omeka.lib.jmu.edu/erp/items/show/2961,,,,,,,,,,,,,,,,,,,,,,,,,,,,,,,,,,,,,,,,,"Commonwealth v. Bernard Lam and Kemper Dean",Misdemeanor^^guilty,"Misdemeanor; Guilty",,"Rockingham County Circuit Court ","JMU Libraries",1924,"Craig Schaefer, Kayla Heslin, Selena St. Andre","This work has been identified as being free of known restrictions under copyright law, including all related and neighboring rights. (<a href=""https://creativecommons.org/publicdomain/mark/1.0/"" target=""_blank"" rel=""noreferrer noopener"">https://creativecommons.org/publicdomain/mark/1.0/</a>)",,PDF,,,RcPr-box4-022,,,,,,,,,,,,,,,,,,,,,,,,,,,,,,,,,,,,,,,,,,,"Dean,Lam",https://omeka.lib.jmu.edu/erp/files/original/2561242270e27564eec3aca42ae4af88.pdf,Text,"Rockingham County Prohibition Records: Criminal Cases",1,0
6703,https://omeka.lib.jmu.edu/erp/items/show/6703,,,,,,,,,,,,,,,,,,,,,,,,,,,,,,,,,,,,,,,,,"Commonwealth v. Central Dean",Felony^^Murder,"Defendant charged with felony murder.","Rockingham County Criminal Court",,"JMU Libraries",1928,"Jennifer Taylor","This work has been identified as being free of known restrictions under copyright law, including all related and neighboring rights.<br /><a href=""https://creativecommons.org/publicdomain/mark/1.0/"" target=""_blank"" rel=""noreferrer noopener"">https://creativecommons.org/publicdomain/mark/1.0/</a>",,PDF,,,CCR001_010_305,,,,,,,,,,,,,,,,,,,,,,,,,,,,,,,,,,,,,,,,,,,"Dean,Hensley,Snow",https://omeka.lib.jmu.edu/erp/files/original/Rockingham_County_Criminal_Court_Criminal_Cases/ccr001_010_305-commonwealth-v-central-dean.pdf,Text,"Rockingham County Criminal Court: Criminal Cases",1,1
3073,https://omeka.lib.jmu.edu/erp/items/show/3073,,,,,,,,,,,,,,,,,,,,,,,,,,,,,,,,,,,,,,,,,"Commonwealth v. Ewell Breeden, James T. Dean and Lloyd Dean","Misdemeanor^^guilty^^Asked for a new trial) Dispute over the sentencing of jail time.","Misdemeanor; Guilty",,"Rockingham County Circuit Court ","JMU Libraries",1927,"Craig Schaefer, Kayla Heslin, Selena St. Andre","This work has been identified as being free of known restrictions under copyright law, including all related and neighboring rights. (<a href=""https://creativecommons.org/publicdomain/mark/1.0/"" target=""_blank"" rel=""noreferrer noopener"">https://creativecommons.org/publicdomain/mark/1.0/</a>)",,"PDF ",,,RcPr-box6-019,,,,,,,,,,,,,,,,,,,,,,,,,,,,,,,,,,,,,,,,,,,"Breeden,Dean",https://omeka.lib.jmu.edu/erp/files/original/302cbd64d250a55f9018483d7e6cde30.pdf,Text,"Rockingham County Prohibition Records: Criminal Cases",1,0
3004,https://omeka.lib.jmu.edu/erp/items/show/3004,,,,,,,,,,,,,,,,,,,,,,,,,,,,,,,,,,,,,,,,,"Commonwealth v. George Crawford and Hurdle Dean",Misdemeanor^^Indictment,"Misdemeanor; Indictment",,"Rockingham County Circuit Court ","JMU Libraries",1925,"Craig Schaefer, Kayla Heslin, Selena St. Andre","This work has been identified as being free of known restrictions under copyright law, including all related and neighboring rights. (<a href=""https://creativecommons.org/publicdomain/mark/1.0/"" target=""_blank"" rel=""noreferrer noopener"">https://creativecommons.org/publicdomain/mark/1.0/</a>)",,"PDF ",,,RcPr-box5-006,,,,,,,,,,,,,,,,,,,,,,,,,,,,,,,,,,,,,,,,,,,"Crawford,Dean",https://omeka.lib.jmu.edu/erp/files/original/865240b5422443c30b1077f59a31e12c.pdf,Text,"Rockingham County Prohibition Records: Criminal Cases",1,0
3227,https://omeka.lib.jmu.edu/erp/items/show/3227,,,,,,,,,,,,,,,,,,,,,,,,,,,,,,,,,,,,,,,,,"Commonwealth v. George Dean","Felony^^Indictment^^posession ardent spirits","Felony; Indictment",,"Rockingham County Circuit Court ","JMU Libraries",1930,"Craig Schaefer, Kayla Heslin, Selena St. Andre","This work has been identified as being free of known restrictions under copyright law, including all related and neighboring rights. (<a href=""https://creativecommons.org/publicdomain/mark/1.0/"" target=""_blank"" rel=""noreferrer noopener"">https://creativecommons.org/publicdomain/mark/1.0/</a>)",,PDF,,,RcPr-box8-035,,,,,,,,,,,,,,,,,,,,,,,,,,,,,,,,,,,,,,,,,,,Dean,https://omeka.lib.jmu.edu/erp/files/original/d12f11d300fd06a75b58b901f511d349.pdf,Text,"Rockingham County Prohibition Records: Criminal Cases",1,0
2882,https://omeka.lib.jmu.edu/erp/items/show/2882,,,,,,,,,,,,,,,,,,,,,,,,,,,,,,,,,,,,,,,,,"Commonwealth v. George Dean and Rose Dean","Misdemeanor^^Indictment^^capias warrant^^manufacture^^sell^^offer^^transport^^dispense^^advertise^^receive order for ardent spirits","Misdemeanor; Indictment",,"Rockingham County Circuit Court ","JMU Libraries",1923,"Craig Schaefer, Kayla Heslin, Selena St. Andre","This work has been identified as being free of known restrictions under copyright law, including all related and neighboring rights. (<a href=""https://creativecommons.org/publicdomain/mark/1.0/"" target=""_blank"" rel=""noreferrer noopener"">https://creativecommons.org/publicdomain/mark/1.0/</a>)",,PDF,,,RcPr-box3-006,,,,,,,,,,,,,,,,,,,,,,,,,,,,,,,,,,,,,,,,,,,Dean,https://omeka.lib.jmu.edu/erp/files/original/0ab4b1462f407c2c841a053559be3860.pdf,Text,"Rockingham County Prohibition Records: Criminal Cases",1,0
2883,https://omeka.lib.jmu.edu/erp/items/show/2883,,,,,,,,,,,,,,,,,,,,,,,,,,,,,,,,,,,,,,,,,"Commonwealth v. George L. Dean and S.L. Michael","Misdemeanor^^guilty^^transport ardent spirits","Misdemeanor; Guilty",,"Rockingham County Circuit Court ","JMU Libraries",1923,"Craig Schaefer, Kayla Heslin, Selena St. Andre","This work has been identified as being free of known restrictions under copyright law, including all related and neighboring rights. (<a href=""https://creativecommons.org/publicdomain/mark/1.0/"" target=""_blank"" rel=""noreferrer noopener"">https://creativecommons.org/publicdomain/mark/1.0/</a>)",,PDF,,,RcPr-box3-007,,,,,,,,,,,,,,,,,,,,,,,,,,,,,,,,,,,,,,,,,,,"Dean,Michael",https://omeka.lib.jmu.edu/erp/files/original/d9de5de0d65c031469e10c18e5b66e84.pdf,Text,"Rockingham County Prohibition Records: Criminal Cases",1,0
2944,https://omeka.lib.jmu.edu/erp/items/show/2944,,,,,,,,,,,,,,,,,,,,,,,,,,,,,,,,,,,,,,,,,"Commonwealth v. George W. Dean","Misdemeanor^^Indictment^^Search Warrant^^Guns seized","Misdemeanor; Indictment",,"Rockingham County Circuit Court ","JMU Libraries",1924,"Craig Schaefer, Kayla Heslin, Selena St. Andre","This work has been identified as being free of known restrictions under copyright law, including all related and neighboring rights. (<a href=""https://creativecommons.org/publicdomain/mark/1.0/"" target=""_blank"" rel=""noreferrer noopener"">https://creativecommons.org/publicdomain/mark/1.0/</a>)",,PDF,,,RcPr-box4-005,,,,,,,,,,,,,,,,,,,,,,,,,,,,,,,,,,,,,,,,,,,Dean,https://omeka.lib.jmu.edu/erp/files/original/14d3c659a69a6a4ab34f7af190f5e797.pdf,Text,"Rockingham County Prohibition Records: Criminal Cases",1,0
3040,https://omeka.lib.jmu.edu/erp/items/show/3040,,,,,,,,,,,,,,,,,,,,,,,,,,,,,,,,,,,,,,,,,"Commonwealth v. Herbert Dean","Misdemeanor^^Indictment^^Found not guilty","Misdemeanor; Indictment",,"Rockingham County Circuit Court ","JMU Libraries",1926,"Craig Schaefer, Kayla Heslin, Selena St. Andre","This work has been identified as being free of known restrictions under copyright law, including all related and neighboring rights. (<a href=""https://creativecommons.org/publicdomain/mark/1.0/"" target=""_blank"" rel=""noreferrer noopener"">https://creativecommons.org/publicdomain/mark/1.0/</a>)",,"PDF ",,,RcPr-box5-042,,,,,,,,,,,,,,,,,,,,,,,,,,,,,,,,,,,,,,,,,,,Dean,https://omeka.lib.jmu.edu/erp/files/original/f5484896833f349c6391749bfbae0bde.pdf,Text,"Rockingham County Prohibition Records: Criminal Cases",1,0
3228,https://omeka.lib.jmu.edu/erp/items/show/3228,,,,,,,,,,,,,,,,,,,,,,,,,,,,,,,,,,,,,,,,,"Commonwealth v. Herbert Dean","Felony^^not guilty^^posession ardent spirits","Felony; Not Guilty",,"Rockingham County Circuit Court ","JMU Libraries",1930,"Craig Schaefer, Kayla Heslin, Selena St. Andre","This work has been identified as being free of known restrictions under copyright law, including all related and neighboring rights. (<a href=""https://creativecommons.org/publicdomain/mark/1.0/"" target=""_blank"" rel=""noreferrer noopener"">https://creativecommons.org/publicdomain/mark/1.0/</a>)",,PDF,,,RcPr-box8-036,,,,,,,,,,,,,,,,,,,,,,,,,,,,,,,,,,,,,,,,,,,Dean,https://omeka.lib.jmu.edu/erp/files/original/82b0fcf58906798747b59ab96006c81c.pdf,Text,"Rockingham County Prohibition Records: Criminal Cases",1,0
6569,https://omeka.lib.jmu.edu/erp/items/show/6569,,,,,,,,,,,,,,,,,,,,,,,,,,,,,,,,,,,,,,,,,"Commonwealth v. James Snow",Felony^^Murder,"Defendant charged with felony murder.","Rockingham County Criminal Court",,"JMU Libraries",1928,"Jennifer Taylor","This work has been identified as being free of known restrictions under copyright law, including all related and neighboring rights.<br /><a href=""https://creativecommons.org/publicdomain/mark/1.0/"" target=""_blank"" rel=""noreferrer noopener"">https://creativecommons.org/publicdomain/mark/1.0/</a>",,PDF,,,CCR001_010_309,,,,,,,,,,,,,,,,,,,,,,,,,,,,,,,,,,,,,,,,,,,"Dean,Snow",https://omeka.lib.jmu.edu/erp/files/original/Rockingham_County_Criminal_Court_Criminal_Cases/ccr001_010_309-commonwealth-v-james-snow.pdf,Text,"Rockingham County Criminal Court: Criminal Cases",1,1
3229,https://omeka.lib.jmu.edu/erp/items/show/3229,,,,,,,,,,,,,,,,,,,,,,,,,,,,,,,,,,,,,,,,,"Commonwealth v. John Dean, George Crawford and Hurdle Dean","Felony^^Indictment^^manufacture ardent spirits","Felony; Indictment",,"Rockingham County Circuit Court ","JMU Libraries",1930,"Craig Schaefer, Kayla Heslin, Selena St. Andre","This work has been identified as being free of known restrictions under copyright law, including all related and neighboring rights. (<a href=""https://creativecommons.org/publicdomain/mark/1.0/"" target=""_blank"" rel=""noreferrer noopener"">https://creativecommons.org/publicdomain/mark/1.0/</a>)",,PDF,,,RcPr-box8-037,,,,,,,,,,,,,,,,,,,,,,,,,,,,,,,,,,,,,,,,,,,"Crawford,Dean",https://omeka.lib.jmu.edu/erp/files/original/947dfde6d27a4d1ff98dfea30141a208.pdf,Text,"Rockingham County Prohibition Records: Criminal Cases",1,0
6542,https://omeka.lib.jmu.edu/erp/items/show/6542,,,,,,,,,,,,,,,,,,,,,,,,,,,,,,,,,,,,,,,,,"Commonwealth v. Kemper Dean",Misdemeanor,"Defendant charged with a misdemeanor.","Rockingham County Criminal Court",,"JMU Libraries",1925,"Jennifer Taylor","This work has been identified as being free of known restrictions under copyright law, including all related and neighboring rights.<br /><a href=""https://creativecommons.org/publicdomain/mark/1.0/"" target=""_blank"" rel=""noreferrer noopener"">https://creativecommons.org/publicdomain/mark/1.0/</a>",,PDF,,,CCR001_009_272,,,,,,,,,,,,,,,,,,,,,,,,,,,,,,,,,,,,,,,,,,,Dean,https://omeka.lib.jmu.edu/erp/files/original/Rockingham_County_Criminal_Court_Criminal_Cases/ccr001_009_272-commonwealth-v-kemper-dean.pdf,Text,"Rockingham County Criminal Court: Criminal Cases",1,1
2852,https://omeka.lib.jmu.edu/erp/items/show/2852,,,,,,,,,,,,,,,,,,,,,,,,,,,,,,,,,,,,,,,,,"Commonwealth v. L.F. Lam and J.R. Dean","Misdemeanor^^guilty^^transporting ardent spirits","Misdemeanor; Guilty",,"Rockingham County Circuit Court ","JMU Libraries",1922,"Craig Schaefer, Kayla Heslin, Selena St. Andre","This work has been identified as being free of known restrictions under copyright law, including all related and neighboring rights. (<a href=""https://creativecommons.org/publicdomain/mark/1.0/"" target=""_blank"" rel=""noreferrer noopener"">https://creativecommons.org/publicdomain/mark/1.0/</a>)",,"PDF ",,,RcPr-box2-033,,,,,,,,,,,,,,,,,,,,,,,,,,,,,,,,,,,,,,,,,,,"Dean,Lam",https://omeka.lib.jmu.edu/erp/files/original/bc187e85832ac13d813b30732ea93222.pdf,Text,"Rockingham County Prohibition Records: Criminal Cases",1,0
2945,https://omeka.lib.jmu.edu/erp/items/show/2945,,,,,,,,,,,,,,,,,,,,,,,,,,,,,,,,,,,,,,,,,"Commonwealth v. Luther Dean","Felony^^Indictment^^Long jail time","Felony; Indictment",,"Rockingham County Circuit Court ","JMU Libraries",1924,"Craig Schaefer, Kayla Heslin, Selena St. Andre","This work has been identified as being free of known restrictions under copyright law, including all related and neighboring rights. (<a href=""https://creativecommons.org/publicdomain/mark/1.0/"" target=""_blank"" rel=""noreferrer noopener"">https://creativecommons.org/publicdomain/mark/1.0/</a>)",,PDF,,,RcPr-box4-006,,,,,,,,,,,,,,,,,,,,,,,,,,,,,,,,,,,,,,,,,,,Dean,https://omeka.lib.jmu.edu/erp/files/original/68942e45922037976cfbfd67c5ac991e.pdf,Text,"Rockingham County Prohibition Records: Criminal Cases",1,0
3230,https://omeka.lib.jmu.edu/erp/items/show/3230,,,,,,,,,,,,,,,,,,,,,,,,,,,,,,,,,,,,,,,,,"Commonwealth v. Rose Dean","Felony^^Indictment^^posession^^apply for release from imprisonment","Felony; Indictment",,"Rockingham County Circuit Court ","JMU Libraries",1930,"Craig Schaefer, Kayla Heslin, Selena St. Andre","This work has been identified as being free of known restrictions under copyright law, including all related and neighboring rights. (<a href=""https://creativecommons.org/publicdomain/mark/1.0/"" target=""_blank"" rel=""noreferrer noopener"">https://creativecommons.org/publicdomain/mark/1.0/</a>)",,PDF,,,RcPr-box8-038,,,,,,,,,,,,,,,,,,,,,,,,,,,,,,,,,,,,,,,,,,,Dean,https://omeka.lib.jmu.edu/erp/files/original/6b81f3dc0c9ddcaaa1e1b13f03b1d673.pdf,Text,"Rockingham County Prohibition Records: Criminal Cases",1,0
