﻿"Item Id","Item URI","Dublin Core:Alternative Title","Dublin Core:Abstract","Dublin Core:Table Of Contents","Dublin Core:Date Available","Dublin Core:Date Created","Dublin Core:Date Accepted","Dublin Core:Date Copyrighted","Dublin Core:Date Submitted","Dublin Core:Date Issued","Dublin Core:Date Modified","Dublin Core:Date Valid","Dublin Core:Access Rights","Dublin Core:License","Dublin Core:Conforms To","Dublin Core:Has Format","Dublin Core:Has Part","Dublin Core:Has Version","Dublin Core:Is Format Of","Dublin Core:Is Part Of","Dublin Core:Is Referenced By","Dublin Core:Is Replaced By","Dublin Core:Is Required By","Dublin Core:Is Version Of","Dublin Core:References","Dublin Core:Replaces","Dublin Core:Requires","Dublin Core:Extent","Dublin Core:Medium","Dublin Core:Bibliographic Citation","Dublin Core:Spatial Coverage","Dublin Core:Temporal Coverage","Dublin Core:Accrual Method","Dublin Core:Accrual Periodicity","Dublin Core:Accrual Policy","Dublin Core:Audience","Dublin Core:Audience Education Level","Dublin Core:Mediator","Dublin Core:Instructional Method","Dublin Core:Provenance","Dublin Core:Rights Holder","Dublin Core:Title","Dublin Core:Subject","Dublin Core:Description","Dublin Core:Creator","Dublin Core:Source","Dublin Core:Publisher","Dublin Core:Date","Dublin Core:Contributor","Dublin Core:Rights","Dublin Core:Relation","Dublin Core:Format","Dublin Core:Language","Dublin Core:Type","Dublin Core:Identifier","Dublin Core:Coverage","Item Type Metadata:Text","Item Type Metadata:Interviewer","Item Type Metadata:Interviewee","Item Type Metadata:Location","Item Type Metadata:Transcription","Item Type Metadata:Local URL","Item Type Metadata:Original Format","Item Type Metadata:Physical Dimensions","Item Type Metadata:Duration","Item Type Metadata:Compression","Item Type Metadata:Producer","Item Type Metadata:Director","Item Type Metadata:Bit Rate/Frequency","Item Type Metadata:Time Summary","Item Type Metadata:Email Body","Item Type Metadata:Subject Line","Item Type Metadata:From","Item Type Metadata:To","Item Type Metadata:CC","Item Type Metadata:BCC","Item Type Metadata:Number of Attachments","Item Type Metadata:Standards","Item Type Metadata:Objectives","Item Type Metadata:Materials","Item Type Metadata:Lesson Plan Text","Item Type Metadata:URL","Item Type Metadata:Event Type","Item Type Metadata:Participants","Item Type Metadata:Birth Date","Item Type Metadata:Birthplace","Item Type Metadata:Death Date","Item Type Metadata:Occupation","Item Type Metadata:Biographical Text","Item Type Metadata:Bibliography","Item Type Metadata:Player","Item Type Metadata:Episode","Item Type Metadata:Season","Item Type Metadata:Episode Type","Item Type Metadata:Explicit","Item Type Metadata:Block","PDF Text:Text",tags,file,itemType,collection,public,featured
451,https://omeka.lib.jmu.edu/erp/items/show/451,,,,,,,,,,,,,,,,,,,,,,,,,,,,,,,,,,,,,,,,,"Smith, Q. E.",,"Location: Spotswood Trail",,"Sipe, Ed - Williams, HE","Rockingham County Circuit Courthouse",,"Pake Davis, Tristan Nelson, Liana Bayne","This work has been identified as being free of known restrictions under copyright law, including all related and neighboring rights.&nbsp;(<a href=""https://creativecommons.org/publicdomain/mark/1.0/"" target=""_blank"" rel=""noreferrer"">https://creativecommons.org/publicdomain/mark/1.0/</a>)",,PDF,,,smith-q-e.pdf,"Tract(s): 77",,,,,,,,,,,,,,,,,,,,,,,,,,,,,,,,,,,,,,,,,,Smith,https://omeka.lib.jmu.edu/erp/files/original/4cb0bef268060efe12f549ca6e3528be.pdf,Text,"Rockingham County SNP Records: Court Proceedings",1,0
452,https://omeka.lib.jmu.edu/erp/items/show/452,,,,,,,,,,,,,,,,,,,,,,,,,,,,,,,,,,,,,,,,,"Smith, Jos S.",,"Location: Naked Creek",,"Sipe, Ed - Williams, HE","Rockingham County Circuit Courthouse",,"Pake Davis, Tristan Nelson, Liana Bayne","This work has been identified as being free of known restrictions under copyright law, including all related and neighboring rights.&nbsp;(<a href=""https://creativecommons.org/publicdomain/mark/1.0/"" target=""_blank"" rel=""noreferrer"">https://creativecommons.org/publicdomain/mark/1.0/</a>)",,PDF,,,smith-jos-s.pdf,"Tract(s): 126",,,,,,,,,,,,,,,,,,,,,,,,,,,,,,,,,,,,,,,,,,Smith,https://omeka.lib.jmu.edu/erp/files/original/7200fef0b6fd103a2c90af000d60d4da.pdf,Text,"Rockingham County SNP Records: Court Proceedings",1,0
453,https://omeka.lib.jmu.edu/erp/items/show/453,,,,,,,,,,,,,,,,,,,,,,,,,,,,,,,,,,,,,,,,,"Smith, C.W. ",,"Location: Positions 3 to 4 in Page and Rockingham Counties",,"Sipe, Ed - Williams, HE","Rockingham County Circuit Courthouse",,"Pake Davis, Tristan Nelson, Liana Bayne","This work has been identified as being free of known restrictions under copyright law, including all related and neighboring rights.&nbsp;(<a href=""https://creativecommons.org/publicdomain/mark/1.0/"" target=""_blank"" rel=""noreferrer"">https://creativecommons.org/publicdomain/mark/1.0/</a>)",,PDF,,,smith-c-w.pdf,"Tract(s): 20",,,,,,,,,,,,,,,,,,,,,,,,,,,,,,,,,,,,,,,,,,Smith,https://omeka.lib.jmu.edu/erp/files/original/926c8ce19d70467f83dccdc74b6fbccc.pdf,Text,"Rockingham County SNP Records: Court Proceedings",1,0
2767,https://omeka.lib.jmu.edu/erp/items/show/2767,,,,,,,,,,,,,,,,,,,,,,,,,,,,,,,,,,,,,,,,,"Commonwealth v. Solomon Smith",,,,"Rockingham County Circuit Court ","JMU Libraries",1917,"Craig Schaefer, Kayla Heslin, Selena St. Andre","This work has been identified as being free of known restrictions under copyright law, including all related and neighboring rights. (<a href=""https://creativecommons.org/publicdomain/mark/1.0/"" target=""_blank"" rel=""noreferrer noopener"">https://creativecommons.org/publicdomain/mark/1.0/</a>)",,"PDF ",,,RcPr-box1-028,,,,,,,,,,,,,,,,,,,,,,,,,,,,,,,,,,,,,,,,,,,Smith,https://omeka.lib.jmu.edu/erp/files/original/8eb42e1d29a6b346b58b1c194e4b4e62.pdf,Text,"Rockingham County Prohibition Records: Criminal Cases",1,0
2784,https://omeka.lib.jmu.edu/erp/items/show/2784,,,,,,,,,,,,,,,,,,,,,,,,,,,,,,,,,,,,,,,,,"Commonwealth v. Solomon Smith",,,,"Rockingham County Circuit Court ","JMU Libraries",1918,"Craig Schaefer, Kayla Heslin, Selena St. Andre","This work has been identified as being free of known restrictions under copyright law, including all related and neighboring rights. (<a href=""https://creativecommons.org/publicdomain/mark/1.0/"" target=""_blank"" rel=""noreferrer noopener"">https://creativecommons.org/publicdomain/mark/1.0/</a>)",,"PDF ",,,RcPr-box1-045,,,,,,,,,,,,,,,,,,,,,,,,,,,,,,,,,,,,,,,,,,,Smith,https://omeka.lib.jmu.edu/erp/files/original/b0d7e9491d4aa8503eb342194a11727a.pdf,Text,"Rockingham County Prohibition Records: Criminal Cases",1,0
2815,https://omeka.lib.jmu.edu/erp/items/show/2815,,,,,,,,,,,,,,,,,,,,,,,,,,,,,,,,,,,,,,,,,"Commonwealth v. D.E. Evers and Lacy D. Smith",,,,"Rockingham County Circuit Court ","JMU Libraries",1921,"Craig Schaefer, Kayla Heslin, Selena St. Andre","This work has been identified as being free of known restrictions under copyright law, including all related and neighboring rights. (<a href=""https://creativecommons.org/publicdomain/mark/1.0/"" target=""_blank"" rel=""noreferrer noopener"">https://creativecommons.org/publicdomain/mark/1.0/</a>)",,"PDF ",,,RcPr-box1-076,,,,,,,,,,,,,,,,,,,,,,,,,,,,,,,,,,,,,,,,,,,"Evers,Smith",https://omeka.lib.jmu.edu/erp/files/original/44847661c1fa998ba684de712060b344.pdf,Text,"Rockingham County Prohibition Records: Criminal Cases",1,0
2841,https://omeka.lib.jmu.edu/erp/items/show/2841,,,,,,,,,,,,,,,,,,,,,,,,,,,,,,,,,,,,,,,,,"Commonwealth v. Thomas Bare and John Smith","Misdemeanor^^guilty^^manufacture^^sell^^offer^^transport^^dispense^^advertise^^receive order for ardent spirits","Misdemeanor; Guilty",,"Rockingham County Circuit Court ","JMU Libraries",1922,"Craig Schaefer, Kayla Heslin, Selena St. Andre","This work has been identified as being free of known restrictions under copyright law, including all related and neighboring rights. (<a href=""https://creativecommons.org/publicdomain/mark/1.0/"" target=""_blank"" rel=""noreferrer noopener"">https://creativecommons.org/publicdomain/mark/1.0/</a>)",,"PDF ",,,RcPr-box2-022,,,,,,,,,,,,,,,,,,,,,,,,,,,,,,,,,,,,,,,,,,,"Bare,Smith",https://omeka.lib.jmu.edu/erp/files/original/53af37eb2f0123b27c7ad529fd2a0ad2.pdf,Text,"Rockingham County Prohibition Records: Criminal Cases",1,0
2990,https://omeka.lib.jmu.edu/erp/items/show/2990,,,,,,,,,,,,,,,,,,,,,,,,,,,,,,,,,,,,,,,,,"Commonwealth v. Perry Smith",Misdemeanor^^Indictment,"Misdemeanor; Indictment",,"Rockingham County Circuit Court ","JMU Libraries",1924,"Craig Schaefer, Kayla Heslin, Selena St. Andre","This work has been identified as being free of known restrictions under copyright law, including all related and neighboring rights. (<a href=""https://creativecommons.org/publicdomain/mark/1.0/"" target=""_blank"" rel=""noreferrer noopener"">https://creativecommons.org/publicdomain/mark/1.0/</a>)",,PDF,,,RcPr-box4-051,,,,,,,,,,,,,,,,,,,,,,,,,,,,,,,,,,,,,,,,,,,Smith,https://omeka.lib.jmu.edu/erp/files/original/44289b8a5f18e92d2519b75825355a88.pdf,Text,"Rockingham County Prohibition Records: Criminal Cases",1,0
3027,https://omeka.lib.jmu.edu/erp/items/show/3027,,,,,,,,,,,,,,,,,,,,,,,,,,,,,,,,,,,,,,,,,"Commonwealth v. J.H. Smith",Misdemeanor^^Indictment,"Misdemeanor; Indictment",,"Rockingham County Circuit Court ","JMU Libraries",1925,"Craig Schaefer, Kayla Heslin, Selena St. Andre","This work has been identified as being free of known restrictions under copyright law, including all related and neighboring rights. (<a href=""https://creativecommons.org/publicdomain/mark/1.0/"" target=""_blank"" rel=""noreferrer noopener"">https://creativecommons.org/publicdomain/mark/1.0/</a>)",,"PDF ",,,RcPr-box5-029,,,,,,,,,,,,,,,,,,,,,,,,,,,,,,,,,,,,,,,,,,,Smith,https://omeka.lib.jmu.edu/erp/files/original/694d7b5d50acb9d5492abe0d6ac3808b.pdf,Text,"Rockingham County Prohibition Records: Criminal Cases",1,0
3066,https://omeka.lib.jmu.edu/erp/items/show/3066,,,,,,,,,,,,,,,,,,,,,,,,,,,,,,,,,,,,,,,,,"Commonwealth v. O.D. Smith and Jesse Moyers","Misdemeanor^^guilty^^Ford Roadster","Misdemeanor; Guilty",,"Rockingham County Circuit Court ","JMU Libraries",1926,"Craig Schaefer, Kayla Heslin, Selena St. Andre","This work has been identified as being free of known restrictions under copyright law, including all related and neighboring rights. (<a href=""https://creativecommons.org/publicdomain/mark/1.0/"" target=""_blank"" rel=""noreferrer noopener"">https://creativecommons.org/publicdomain/mark/1.0/</a>)",,"PDF ",,,RcPr-box6-012,,,,,,,,,,,,,,,,,,,,,,,,,,,,,,,,,,,,,,,,,,,"Moyers,Smith",https://omeka.lib.jmu.edu/erp/files/original/7855f09148bdaba62b22b2adfb40e55b.pdf,Text,"Rockingham County Prohibition Records: Criminal Cases",1,0
3076,https://omeka.lib.jmu.edu/erp/items/show/3076,,,,,,,,,,,,,,,,,,,,,,,,,,,,,,,,,,,,,,,,,"Commonwealth v. Howard Criddle, William Smith and Myrtle Curry","Misdemeanor^^guilty^^Transport of ardent spirits in an automobile^^arresting deupty requested additional monetary compensation for arrest.","Misdemeanor; Guilty",,"Rockingham County Circuit Court ","JMU Libraries",1927,"Craig Schaefer, Kayla Heslin, Selena St. Andre","This work has been identified as being free of known restrictions under copyright law, including all related and neighboring rights. (<a href=""https://creativecommons.org/publicdomain/mark/1.0/"" target=""_blank"" rel=""noreferrer noopener"">https://creativecommons.org/publicdomain/mark/1.0/</a>)",,"PDF ",,,RcPr-box6-022,,,,,,,,,,,,,,,,,,,,,,,,,,,,,,,,,,,,,,,,,,,"Criddle,Curry,Smith",https://omeka.lib.jmu.edu/erp/files/original/63a1b87312a4c0f9fccdcfeace5ba576.pdf,Text,"Rockingham County Prohibition Records: Criminal Cases",1,0
3111,https://omeka.lib.jmu.edu/erp/items/show/3111,,,,,,,,,,,,,,,,,,,,,,,,,,,,,,,,,,,,,,,,,"Commonwealth v. Russell Smith",Misdemeanor^^Indictment^^posession,"Misdemeanor; Indictment",,"Rockingham County Circuit Court ","JMU Libraries",1927,"Craig Schaefer, Kayla Heslin, Selena St. Andre","This work has been identified as being free of known restrictions under copyright law, including all related and neighboring rights. (<a href=""https://creativecommons.org/publicdomain/mark/1.0/"" target=""_blank"" rel=""noreferrer noopener"">https://creativecommons.org/publicdomain/mark/1.0/</a>)",,"PDF ",,,RcPr-box7-002,,,,,,,,,,,,,,,,,,,,,,,,,,,,,,,,,,,,,,,,,,,Smith,https://omeka.lib.jmu.edu/erp/files/original/699ff528abc21b770a691914314c21dd.pdf,Text,"Rockingham County Prohibition Records: Criminal Cases",1,0
3167,https://omeka.lib.jmu.edu/erp/items/show/3167,,,,,,,,,,,,,,,,,,,,,,,,,,,,,,,,,,,,,,,,,"Commonwealth v. Perry Smith","Felony^^Indictment^^Posession of still^^letter (suggests officers look down on multiple offences)","Felony; Indictment",,"Rockingham County Circuit Court ","JMU Libraries",1928,"Craig Schaefer, Kayla Heslin, Selena St. Andre","This work has been identified as being free of known restrictions under copyright law, including all related and neighboring rights. (<a href=""https://creativecommons.org/publicdomain/mark/1.0/"" target=""_blank"" rel=""noreferrer noopener"">https://creativecommons.org/publicdomain/mark/1.0/</a>)",,"PDF ",,,RcPr-box7-058,,,,,,,,,,,,,,,,,,,,,,,,,,,,,,,,,,,,,,,,,,,Smith,https://omeka.lib.jmu.edu/erp/files/original/4b225e182760aee6e50baebed6c2fb01.pdf,Text,"Rockingham County Prohibition Records: Criminal Cases",1,0
3168,https://omeka.lib.jmu.edu/erp/items/show/3168,,,,,,,,,,,,,,,,,,,,,,,,,,,,,,,,,,,,,,,,,"Commonwealth v. Robert Smith",Misdemeanor^^Indictment^^posession,"Misdemeanor; Indictment",,"Rockingham County Circuit Court ","JMU Libraries",1928,"Craig Schaefer, Kayla Heslin, Selena St. Andre","This work has been identified as being free of known restrictions under copyright law, including all related and neighboring rights. (<a href=""https://creativecommons.org/publicdomain/mark/1.0/"" target=""_blank"" rel=""noreferrer noopener"">https://creativecommons.org/publicdomain/mark/1.0/</a>)",,"PDF ",,,RcPr-box7-059,,,,,,,,,,,,,,,,,,,,,,,,,,,,,,,,,,,,,,,,,,,Smith,https://omeka.lib.jmu.edu/erp/files/original/c273ba7f9f007f13d72792a629357ccd.pdf,Text,"Rockingham County Prohibition Records: Criminal Cases",1,0
3325,https://omeka.lib.jmu.edu/erp/items/show/3325,,,,,,,,,,,,,,,,,,,,,,,,,,,,,,,,,,,,,,,,,"Commonwealth v. Emanuel Smith","Misdemeanor^^Indictment^^operated an automobile under the influence","Misdemeanor; Indictment",,"Rockingham County Circuit Court ","JMU Libraries",1931,"Craig Schaefer, Kayla Heslin, Selena St. Andre","This work has been identified as being free of known restrictions under copyright law, including all related and neighboring rights. (<a href=""https://creativecommons.org/publicdomain/mark/1.0/"" target=""_blank"" rel=""noreferrer noopener"">https://creativecommons.org/publicdomain/mark/1.0/</a>)",,"PDF ",,,RcPr-box9-051,,,,,,,,,,,,,,,,,,,,,,,,,,,,,,,,,,,,,,,,,,,Smith,https://omeka.lib.jmu.edu/erp/files/original/c51c69b4125230fe7f17ddea12d3ed4c.pdf,Text,"Rockingham County Prohibition Records: Criminal Cases",1,0
4229,https://omeka.lib.jmu.edu/erp/items/show/4229,,,,,,,,,,,,,,,,,,,,,,,,,,,,,,,,,,,,,,,,,"Indenture of Apprenticeship, Ralph Smith to William Donovan ",,"House joiner","Overseers of the Poor",,"JMU Libraries ",1805,,"This work has been identified as being free of known restrictions under copyright law, including all related and neighboring rights. (<a href=""https://creativecommons.org/publicdomain/mark/1.0/"">https://creativecommons.org/publicdomain/mark/1.0/</a>)",,"PDF ",,,Osp003_001_056,,,,,,,,,,,,,,,,,,,,,,,,,,,,,,,,,,,,,,,,,,,"Donovan,Smith","https://omeka.lib.jmu.edu/erp/files/original/8784714ffe0634d14064592ffcd7681e.pdf,https://omeka.lib.jmu.edu/erp/files/original/f930632b3e175ed7e178d6e5aa0eb788.pdf",Text,"Overseers of the Poor: Indentures of Apprenticeship",1,0
4337,https://omeka.lib.jmu.edu/erp/items/show/4337,,,,,,,,,,,,,,,,,,,,,,,,,,,,,,,,,,,,,,,,,"Indenture of Apprenticeship, Reuben Terrell to William Smith ",,"shoemaker ","Overseers of the Poor",,"JMU Libraries ",1823,,"This work has been identified as being free of known restrictions under copyright law, including all related and neighboring rights. (<a href=""https://creativecommons.org/publicdomain/mark/1.0/"">https://creativecommons.org/publicdomain/mark/1.0/</a>)",,"PDF ",,,Osp003_003_050,,,,,,,,,,,,,,,,,,,,,,,,,,,,,,,,,,,,,,,,,,,"Smith,Terrell",https://omeka.lib.jmu.edu/erp/files/original/2bb486b5bb47fa114e6a039442c8c5e3.pdf,Text,"Overseers of the Poor: Indentures of Apprenticeship",1,0
5999,https://omeka.lib.jmu.edu/erp/items/show/5999,,,,,,,,,,,,,,,,,,,,,,,,,,,,,,,,,,,,,,,,,"Varner and Spitler",,"<p><strong>Tract: </strong>104; </p><p><strong>Location: </strong>East Slope of the Blue Ridge-drains of the Thornton River; </p><p><strong>Cost/Acre: </strong>$5.00; </p><p><strong>Estimate Value: </strong>$15.00; </p><p><strong>Number of Acres: </strong>3.0; </p><p><strong>Monies Awarded: </strong>$15.00</p>",,"Rappahannock County Circuit Courthouse","JMU Libraries",,,"<a href=""https://creativecommons.org/licenses/by-nc/4.0/"" target=""_blank"" rel=""noreferrer noopener"">https://creativecommons.org/licenses/by-nc/4.0/</a>",,PDF,,,varner-and-spitler-tract-104,"Tract 104",,,,,,,,,,,,,,,,,,,,,,,,,,,,,,,,,,,,,,,,,,"Burns,Hoffmann,Hopper,Joliffe,Jolliffee,Keys,Kirksey,Loving,McKusick,Orme,Overall,Smith,Spitler,Varner",https://omeka.lib.jmu.edu/erp/files/original/6ae0599126be8c9d339b0f6b7eb4e2e0.pdf,Text,"Rappahannock County SNP Records: Court Proceedings",1,0
6015,https://omeka.lib.jmu.edu/erp/items/show/6015,,,,,,,,,,,,,,,,,,,,,,,,,,,,,,,,,,,,,,,,,"Smith, Virginia",,"<p><strong>Tract: </strong>52; </p><p><strong>Location: </strong>On Devil Stairs Run; </p><p><strong>Cost/Acre: </strong>$4.00; </p><p><strong>Estimate Value: </strong>$8.00; </p><p><strong>Number of Acres: </strong>2.0; </p><p><strong>Monies Awarded: </strong>$8.00</p>",,"Rappahannock County Circuit Courthouse","JMU Libraries",,,"<a href=""https://creativecommons.org/licenses/by-nc/4.0/"" target=""_blank"" rel=""noreferrer noopener"">https://creativecommons.org/licenses/by-nc/4.0/</a>",,PDF,,,smith-virginia-tract-52,"Tract 52",,,,,,,,,,,,,,,,,,,,,,,,,,,,,,,,,,,,,,,,,,"Manuel,Smith",https://omeka.lib.jmu.edu/erp/files/original/716cf0878659f2bc497c48b540598617.pdf,Text,"Rappahannock County SNP Records: Court Proceedings",1,0
6016,https://omeka.lib.jmu.edu/erp/items/show/6016,,,,,,,,,,,,,,,,,,,,,,,,,,,,,,,,,,,,,,,,,"Smith, Virginia",,"<p><strong>Tract: </strong>52 - I; </p><p><strong>Location: </strong>West side of Rush River near head of Harris Hollow; </p><p><strong>Cost/Acre: </strong>$15.34; </p><p><strong>Estimate Value: </strong>$439.00; </p><p><strong>Number of Acres: </strong>154.0; </p><p><strong>Monies Awarded: </strong>$2,383.00</p>",,"Rappahannock County Circuit Courthouse","JMU Libraries",,,"<a href=""https://creativecommons.org/licenses/by-nc/4.0/"" target=""_blank"" rel=""noreferrer noopener"">https://creativecommons.org/licenses/by-nc/4.0/</a>",,PDF,,,smith-virginia-tract-52-i,"Tract 52 - I",,,,,,,,,,,,,,,,,,,,,,,,,,,,,,,,,,,,,,,,,,Smith,https://omeka.lib.jmu.edu/erp/files/original/3a23e9ec606b6bb3eb23b7059ee03022.pdf,Text,"Rappahannock County SNP Records: Court Proceedings",1,0
