﻿"Item Id","Item URI","Dublin Core:Alternative Title","Dublin Core:Abstract","Dublin Core:Table Of Contents","Dublin Core:Date Available","Dublin Core:Date Created","Dublin Core:Date Accepted","Dublin Core:Date Copyrighted","Dublin Core:Date Submitted","Dublin Core:Date Issued","Dublin Core:Date Modified","Dublin Core:Date Valid","Dublin Core:Access Rights","Dublin Core:License","Dublin Core:Conforms To","Dublin Core:Has Format","Dublin Core:Has Part","Dublin Core:Has Version","Dublin Core:Is Format Of","Dublin Core:Is Part Of","Dublin Core:Is Referenced By","Dublin Core:Is Replaced By","Dublin Core:Is Required By","Dublin Core:Is Version Of","Dublin Core:References","Dublin Core:Replaces","Dublin Core:Requires","Dublin Core:Extent","Dublin Core:Medium","Dublin Core:Bibliographic Citation","Dublin Core:Spatial Coverage","Dublin Core:Temporal Coverage","Dublin Core:Accrual Method","Dublin Core:Accrual Periodicity","Dublin Core:Accrual Policy","Dublin Core:Audience","Dublin Core:Audience Education Level","Dublin Core:Mediator","Dublin Core:Instructional Method","Dublin Core:Provenance","Dublin Core:Rights Holder","Dublin Core:Title","Dublin Core:Subject","Dublin Core:Description","Dublin Core:Creator","Dublin Core:Source","Dublin Core:Publisher","Dublin Core:Date","Dublin Core:Contributor","Dublin Core:Rights","Dublin Core:Relation","Dublin Core:Format","Dublin Core:Language","Dublin Core:Type","Dublin Core:Identifier","Dublin Core:Coverage","Item Type Metadata:Text","Item Type Metadata:Interviewer","Item Type Metadata:Interviewee","Item Type Metadata:Location","Item Type Metadata:Transcription","Item Type Metadata:Local URL","Item Type Metadata:Original Format","Item Type Metadata:Physical Dimensions","Item Type Metadata:Duration","Item Type Metadata:Compression","Item Type Metadata:Producer","Item Type Metadata:Director","Item Type Metadata:Bit Rate/Frequency","Item Type Metadata:Time Summary","Item Type Metadata:Email Body","Item Type Metadata:Subject Line","Item Type Metadata:From","Item Type Metadata:To","Item Type Metadata:CC","Item Type Metadata:BCC","Item Type Metadata:Number of Attachments","Item Type Metadata:Standards","Item Type Metadata:Objectives","Item Type Metadata:Materials","Item Type Metadata:Lesson Plan Text","Item Type Metadata:URL","Item Type Metadata:Event Type","Item Type Metadata:Participants","Item Type Metadata:Birth Date","Item Type Metadata:Birthplace","Item Type Metadata:Death Date","Item Type Metadata:Occupation","Item Type Metadata:Biographical Text","Item Type Metadata:Bibliography","Item Type Metadata:Player","Item Type Metadata:Episode","Item Type Metadata:Season","Item Type Metadata:Episode Type","Item Type Metadata:Explicit","Item Type Metadata:Block","PDF Text:Text",tags,file,itemType,collection,public,featured
8541,https://omeka.lib.jmu.edu/erp/items/show/8541,,,,,,,,,,,,,,,,,,,,,,,,,,,,,,,,,,,,,,,,,"Commonwealth v Lester Locker and Carl Turner",Felony^^Murder,"Defendant charged with felony murder (note: bullets, fingerprints, confession, plea of insanity)","Rockingham County Circuit Court",,"JMU Libraries",1936,"Nara Holdaway","This work has been identified as being free of known restrictions under copyright law, including all related and neighboring rights.<br /><a href=""https://creativecommons.org/publicdomain/mark/1.0/"" target=""_blank"" rel=""noreferrer noopener"">https://creativecommons.org/publicdomain/mark/1.0/</a>",,PDF,,,Ccr001_013_004,,,,,,,,,,,,,,,,,,,,,,,,,,,,,,,,,,,,,,,,,,,"Locker,Turner",https://omeka.lib.jmu.edu/erp/files/original/Rockingham_County_Criminal_Court_Criminal_Cases/ccr001_013_004_commonwealth-v-lester-locker-and-carl-turner.pdf,Text,"Rockingham County Criminal Court: Criminal Cases",1,0
6727,https://omeka.lib.jmu.edu/erp/items/show/6727,,,,,,,,,,,,,,,,,,,,,,,,,,,,,,,,,,,,,,,,,"Commonwealth v. Archie Turner","Felony^^Burglary^^Break and Enter^^Larceny","Defendant charged with felony break and enter and felony larceny.","Rockingham County Criminal Court",,"JMU Libraries",1911,"Jennifer Taylor","This work has been identified as being free of known restrictions under copyright law, including all related and neighboring rights.<br /><a href=""https://creativecommons.org/publicdomain/mark/1.0/"" target=""_blank"" rel=""noreferrer noopener"">https://creativecommons.org/publicdomain/mark/1.0/</a>",,PDF,,,CCR001_006_188,,,,,,,,,,,,,,,,,,,,,,,,,,,,,,,,,,,,,,,,,,,"Turner,Yankey",https://omeka.lib.jmu.edu/erp/files/original/Rockingham_County_Criminal_Court_Criminal_Cases/ccr001_006_188-commonwealth-v-archie-turner.pdf,Text,"Rockingham County Criminal Court: Criminal Cases",1,1
6671,https://omeka.lib.jmu.edu/erp/items/show/6671,,,,,,,,,,,,,,,,,,,,,,,,,,,,,,,,,,,,,,,,,"Commonwealth v. D.E. Croushorn",Felony^^Murder,"Defendant charged with felony murder.","Rockingham County Criminal Court",,"JMU Libraries",1909,"Jennifer Taylor","This work has been identified as being free of known restrictions under copyright law, including all related and neighboring rights.<br /><a href=""https://creativecommons.org/publicdomain/mark/1.0/"" target=""_blank"" rel=""noreferrer noopener"">https://creativecommons.org/publicdomain/mark/1.0/</a>",,PDF,,,CCR001_005_139,,,,,,,,,,,,,,,,,,,,,,,,,,,,,,,,,,,,,,,,,,,"Croushorn,Turner",https://omeka.lib.jmu.edu/erp/files/original/Rockingham_County_Criminal_Court_Criminal_Cases/ccr001_005_139-commonwealth-v-de-croushorn.pdf,Text,"Rockingham County Criminal Court: Criminal Cases",1,1
6662,https://omeka.lib.jmu.edu/erp/items/show/6662,,,,,,,,,,,,,,,,,,,,,,,,,,,,,,,,,,,,,,,,,"Commonwealth v. Dan Wine","Misdemeanor^^Violation of Labor Laws","Defendant charged with misdemeanor violation of labor laws.","Rockingham County Criminal Court",,"JMU Libraries",1921,"Jennifer Taylor","This work has been identified as being free of known restrictions under copyright law, including all related and neighboring rights.<br /><a href=""https://creativecommons.org/publicdomain/mark/1.0/"" target=""_blank"" rel=""noreferrer noopener"">https://creativecommons.org/publicdomain/mark/1.0/</a>",,PDF,,,CCR001_007_234,,,,,,,,,,,,,,,,,,,,,,,,,,,,,,,,,,,,,,,,,,,"Tams,Turner,Wine",https://omeka.lib.jmu.edu/erp/files/original/Rockingham_County_Criminal_Court_Criminal_Cases/ccr001_007_234-commonwealth-v-dan-wine.pdf,Text,"Rockingham County Criminal Court: Criminal Cases",1,1
6657,https://omeka.lib.jmu.edu/erp/items/show/6657,,,,,,,,,,,,,,,,,,,,,,,,,,,,,,,,,,,,,,,,,"Commonwealth v. David F. Dove","Felony^^Burglary^^Break and Enter^^Larceny","Defendant charged with felony break and enter and felony larceny.","Rockingham County Criminal Court",,"JMU Libraries",1912,"Jennifer Taylor","This work has been identified as being free of known restrictions under copyright law, including all related and neighboring rights.<br /><a href=""https://creativecommons.org/publicdomain/mark/1.0/"" target=""_blank"" rel=""noreferrer noopener"">https://creativecommons.org/publicdomain/mark/1.0/</a>",,PDF,,,CCR001_006_194,,,,,,,,,,,,,,,,,,,,,,,,,,,,,,,,,,,,,,,,,,,"Dove,Shultz,Turner",https://omeka.lib.jmu.edu/erp/files/original/Rockingham_County_Criminal_Court_Criminal_Cases/ccr001_006_194-commonwealth-v-david-f-dove.pdf,Text,"Rockingham County Criminal Court: Criminal Cases",1,1
8446,https://omeka.lib.jmu.edu/erp/items/show/8446,,,,,,,,,,,,,,,,,,,,,,,,,,,,,,,,,,,,,,,,,"Commonwealth v. Elijah Turner",Felony^^Assault," Defendant charged with felony assault.",,,"JMU LIbraries",1831,"Jennifer Taylor","This work has been identified as being free of known restrictions under copyright law, including all related and neighboring rights.<br /><a href=""https://creativecommons.org/publicdomain/mark/1.0/"" target=""_blank"" rel=""noreferrer noopener"">https://creativecommons.org/publicdomain/mark/1.0/</a>",,PDF,,,CCR001_001_011,,,,,,,,,,,,,,,,,,,,,,,,,,,,,,,,,,,,,,,,,,,"Fishback,Turner",https://omeka.lib.jmu.edu/erp/files/original/Rockingham_County_Criminal_Court_Criminal_Cases/ccr001_001_011-commonwealth-v-elijah-turner.pdf,Text,"Rockingham County Criminal Court: Criminal Cases",1,0
8423,https://omeka.lib.jmu.edu/erp/items/show/8423,,,,,,,,,,,,,,,,,,,,,,,,,,,,,,,,,,,,,,,,,"Commonwealth v. Herman Sandy",Felony^^Murder,"Defendant charged with felony murder.",,,"JMU Libraries",1931,,"This work has been identified as being free of known restrictions under copyright law, including all related and neighboring rights.<br /><a href=""https://creativecommons.org/publicdomain/mark/1.0/"" target=""_blank"" rel=""noreferrer noopener"">https://creativecommons.org/publicdomain/mark/1.0/</a>",,PDF,,,CCR001_011_005,,,,,,,,,,,,,,,,,,,,,,,,,,,,,,,,,,,,,,,,,,,"Sandy,Turner",https://omeka.lib.jmu.edu/erp/files/original/Rockingham_County_Criminal_Court_Criminal_Cases/ccr001_011_005-commonwealth-v-herman-sandy.pdf,Text,"Rockingham County Criminal Court: Criminal Cases",1,0
6568,https://omeka.lib.jmu.edu/erp/items/show/6568,,,,,,,,,,,,,,,,,,,,,,,,,,,,,,,,,,,,,,,,,"Commonwealth v. James Turner et al. ","Misdemeanor^^Offences against property^^Property Damage","Defendants charged with misdemeanor property damage.","Rockingham County Criminal Court",,"JMU Libraries",1919,"Jennifer Taylor","This work has been identified as being free of known restrictions under copyright law, including all related and neighboring rights.<br /><a href=""https://creativecommons.org/publicdomain/mark/1.0/"" target=""_blank"" rel=""noreferrer noopener"">https://creativecommons.org/publicdomain/mark/1.0/</a>",,PDF,,,CCR001_007_219,,,,,,,,,,,,,,,,,,,,,,,,,,,,,,,,,,,,,,,,,,,"Hoover,Turner",https://omeka.lib.jmu.edu/erp/files/original/Rockingham_County_Criminal_Court_Criminal_Cases/ccr001_007_219-commonwealth-v-james-turner-et-al-.pdf,Text,"Rockingham County Criminal Court: Criminal Cases",1,1
2749,https://omeka.lib.jmu.edu/erp/items/show/2749,,,,,,,,,,,,,,,,,,,,,,,,,,,,,,,,,,,,,,,,,"Commonwealth v. Joseph Turner","furnished intoxicating liquor^^Capias (not present at hearing)",,,"Rockingham County Circuit Court ","JMU Libraries",1916,"Craig Schaefer, Kayla Heslin, Selena St. Andre","This work has been identified as being free of known restrictions under copyright law, including all related and neighboring rights. (<a href=""https://creativecommons.org/publicdomain/mark/1.0/"" target=""_blank"" rel=""noreferrer noopener"">https://creativecommons.org/publicdomain/mark/1.0/</a>)",,"PDF ",,,RcPr-box1-010,,,,,,,,,,,,,,,,,,,,,,,,,,,,,,,,,,,,,,,,,,,Turner,https://omeka.lib.jmu.edu/erp/files/original/04eb9f6f4bc75dfc030827634c36a456.pdf,Text,"Rockingham County Prohibition Records: Criminal Cases",1,0
3380,https://omeka.lib.jmu.edu/erp/items/show/3380,,,,,,,,,,,,,,,,,,,,,,,,,,,,,,,,,,,,,,,,,"Commonwealth v. Leonard Turner","Felony^^guilty^^posession of ardent spirits","Felony; Guilty",,"Rockingham County Circuit Court ","JMU Libraries",1933,"Craig Schaefer, Kayla Heslin, Selena St. Andre","This work has been identified as being free of known restrictions under copyright law, including all related and neighboring rights. (<a href=""https://creativecommons.org/publicdomain/mark/1.0/"" target=""_blank"" rel=""noreferrer noopener"">https://creativecommons.org/publicdomain/mark/1.0/</a>)",,"PDF ",,,RcPr-box10-034,,,,,,,,,,,,,,,,,,,,,,,,,,,,,,,,,,,,,,,,,,,Turner,https://omeka.lib.jmu.edu/erp/files/original/5c4497acfbd5ebbba8e11291af6f0b54.pdf,Text,"Rockingham County Prohibition Records: Criminal Cases",1,0
6501,https://omeka.lib.jmu.edu/erp/items/show/6501,,,,,,,,,,,,,,,,,,,,,,,,,,,,,,,,,,,,,,,,,"Commonwealth v. Ora Mumbert and Charles Shoemaker",Felony^^Assault,"Defendants charged with felony assault.","Rockingham County Criminal Court",,"JMU Libraries",1930,"Jennifer Taylor","This work has been identified as being free of known restrictions under copyright law, including all related and neighboring rights.<br /><a href=""https://creativecommons.org/publicdomain/mark/1.0/"" target=""_blank"" rel=""noreferrer noopener"">https://creativecommons.org/publicdomain/mark/1.0/</a>",,PDF,,,CCR001_010_321,,,,,,,,,,,,,,,,,,,,,,,,,,,,,,,,,,,,,,,,,,,"Mumbert,Phillips,Shoemaker,Turner",https://omeka.lib.jmu.edu/erp/files/original/Rockingham_County_Criminal_Court_Criminal_Cases/ccr001_010_321-commonwealth-v-ora-mumbert-and-chas-shoemaker.pdf,Text,"Rockingham County Criminal Court: Criminal Cases",1,1
8367,https://omeka.lib.jmu.edu/erp/items/show/8367,,,,,,,,,,,,,,,,,,,,,,,,,,,,,,,,,,,,,,,,,"Commonwealth v. Philip Hoover","Felony^^Attempted Murder","Defendant charged with felony attempted murder. ",,,"JMU LIbraries",1895,"Jennifer Taylor","This work has been identified as being free of known restrictions under copyright law, including all related and neighboring rights.<br /><a href=""https://creativecommons.org/publicdomain/mark/1.0/"" target=""_blank"" rel=""noreferrer noopener"">https://creativecommons.org/publicdomain/mark/1.0/</a>",,PDF,,,CCR001_002_024,,,,,,,,,,,,,,,,,,,,,,,,,,,,,,,,,,,,,,,,,,,"Hoover,Turner",https://omeka.lib.jmu.edu/erp/files/original/Rockingham_County_Criminal_Court_Criminal_Cases/ccr001_002_024-commonwealth-v-philip-hoover.pdf,Text,"Rockingham County Criminal Court: Criminal Cases",1,0
3207,https://omeka.lib.jmu.edu/erp/items/show/3207,,,,,,,,,,,,,,,,,,,,,,,,,,,,,,,,,,,,,,,,,"Commonwealth v. Roy Turner","Misdemeanor^^Indictment^^operated an automobile under the influence","Misdemeanor; Indictment",,"Rockingham County Circuit Court ","JMU Libraries",1929,"Craig Schaefer, Kayla Heslin, Selena St. Andre","This work has been identified as being free of known restrictions under copyright law, including all related and neighboring rights. (<a href=""https://creativecommons.org/publicdomain/mark/1.0/"" target=""_blank"" rel=""noreferrer noopener"">https://creativecommons.org/publicdomain/mark/1.0/</a>)",,PDF,,,RcPr-box8-015,,,,,,,,,,,,,,,,,,,,,,,,,,,,,,,,,,,,,,,,,,,Turner,https://omeka.lib.jmu.edu/erp/files/original/81df1a690f043b9758a75eb747eb7ca1.pdf,Text,"Rockingham County Prohibition Records: Criminal Cases",1,0
3366,https://omeka.lib.jmu.edu/erp/items/show/3366,,,,,,,,,,,,,,,,,,,,,,,,,,,,,,,,,,,,,,,,,"Commonwealth v. Russell Turner","Misdemeanor^^guilty^^operated an automobile under the influence","Misdemeanor; Guilty",,"Rockingham County Circuit Court ","JMU Libraries",1932,"Craig Schaefer, Kayla Heslin, Selena St. Andre","This work has been identified as being free of known restrictions under copyright law, including all related and neighboring rights. (<a href=""https://creativecommons.org/publicdomain/mark/1.0/"" target=""_blank"" rel=""noreferrer noopener"">https://creativecommons.org/publicdomain/mark/1.0/</a>)",,"PDF ",,,RcPr-box10-020,,,,,,,,,,,,,,,,,,,,,,,,,,,,,,,,,,,,,,,,,,,Turner,https://omeka.lib.jmu.edu/erp/files/original/60854a9adddec493f73d94d5165e7688.pdf,Text,"Rockingham County Prohibition Records: Criminal Cases",1,0
3367,https://omeka.lib.jmu.edu/erp/items/show/3367,,,,,,,,,,,,,,,,,,,,,,,,,,,,,,,,,,,,,,,,,"Commonwealth v. Russell Turner","Misdemeanor^^not guilty^^posession of ardent spirits-moonshine","Misdemeanor; Not Guilty",,"Rockingham County Circuit Court ","JMU Libraries",1932,"Craig Schaefer, Kayla Heslin, Selena St. Andre","This work has been identified as being free of known restrictions under copyright law, including all related and neighboring rights. (<a href=""https://creativecommons.org/publicdomain/mark/1.0/"" target=""_blank"" rel=""noreferrer noopener"">https://creativecommons.org/publicdomain/mark/1.0/</a>)",,"PDF ",,,RcPr-box10-021,,,,,,,,,,,,,,,,,,,,,,,,,,,,,,,,,,,,,,,,,,,Turner,https://omeka.lib.jmu.edu/erp/files/original/b2089c944525e5c8fb31e512658702c6.pdf,Text,"Rockingham County Prohibition Records: Criminal Cases",1,0
8349,https://omeka.lib.jmu.edu/erp/items/show/8349,,,,,,,,,,,,,,,,,,,,,,,,,,,,,,,,,,,,,,,,,"Commonwealth v. Tom Ware",Felony^^Murder,"Defendant charged with felony murder.",,,"JMU Libraries",1932,,"This work has been identified as being free of known restrictions under copyright law, including all related and neighboring rights.<br /><a href=""https://creativecommons.org/publicdomain/mark/1.0/"" target=""_blank"" rel=""noreferrer noopener"">https://creativecommons.org/publicdomain/mark/1.0/</a>",,PDF,,,CCR001_012_005,,,,,,,,,,,,,,,,,,,,,,,,,,,,,,,,,,,,,,,,,,,"Turner,Ware",https://omeka.lib.jmu.edu/erp/files/original/Rockingham_County_Criminal_Court_Criminal_Cases/ccr001_012_005-commonwealth-v-tom-ware.pdf,Text,"Rockingham County Criminal Court: Criminal Cases",1,0
6435,https://omeka.lib.jmu.edu/erp/items/show/6435,,,,,,,,,,,,,,,,,,,,,,,,,,,,,,,,,,,,,,,,,"Commonwealth v. William and Robert Riggleman","Felony^^Burglary^^Break and Enter^^Larceny","Defendants charged with felony break and enter and felony larceny.","Rockingham County Criminal Court",,"JMU Libraries",1908,"Jennifer Taylor","This work has been identified as being free of known restrictions under copyright law, including all related and neighboring rights.<br /><a href=""https://creativecommons.org/publicdomain/mark/1.0/"" target=""_blank"" rel=""noreferrer noopener"">https://creativecommons.org/publicdomain/mark/1.0/</a>",,PDF,,,CCR001_005_126,,,,,,,,,,,,,,,,,,,,,,,,,,,,,,,,,,,,,,,,,,,"Riggleman,Turner",https://omeka.lib.jmu.edu/erp/files/original/Rockingham_County_Criminal_Court_Criminal_Cases/ccr001_005_126-commonwealth-v-william-and-robert-riggleman.pdf,Text,"Rockingham County Criminal Court: Criminal Cases",1,1
3368,https://omeka.lib.jmu.edu/erp/items/show/3368,,,,,,,,,,,,,,,,,,,,,,,,,,,,,,,,,,,,,,,,,"Commonwealth v. William Turner","Misdemeanor^^guilty^^posession of ardent spirits-moonshine","Misdemeanor; Guilty",,"Rockingham County Circuit Court ","JMU Libraries",1932,"Craig Schaefer, Kayla Heslin, Selena St. Andre","This work has been identified as being free of known restrictions under copyright law, including all related and neighboring rights. (<a href=""https://creativecommons.org/publicdomain/mark/1.0/"" target=""_blank"" rel=""noreferrer noopener"">https://creativecommons.org/publicdomain/mark/1.0/</a>)",,"PDF ",,,RcPr-box10-022,,,,,,,,,,,,,,,,,,,,,,,,,,,,,,,,,,,,,,,,,,,Turner,https://omeka.lib.jmu.edu/erp/files/original/73dbe2506b14c16e012c5bcef348e282.pdf,Text,"Rockingham County Prohibition Records: Criminal Cases",1,0
6005,https://omeka.lib.jmu.edu/erp/items/show/6005,,,,,,,,,,,,,,,,,,,,,,,,,,,,,,,,,,,,,,,,,"Turner, W Lauck",,"<p><strong>Tract: </strong>29; </p><p><strong>Location: </strong>On drains of Bear Wallow Creek ; </p><p><strong>Cost/Acre: </strong>$5.08; </p><p><strong>Estimate Value: </strong>$127.00; </p><p><strong>Number of Acres: </strong>25.0; </p><p><strong>Monies Awarded: </strong>$127.00</p>",,"Rappahannock County Circuit Courthouse","JMU Libraries",,,"<a href=""https://creativecommons.org/licenses/by-nc/4.0/"" target=""_blank"" rel=""noreferrer noopener"">https://creativecommons.org/licenses/by-nc/4.0/</a>",,PDF,,,turner-w-lauck-tract-29,"Tract 29",,,,,,,,,,,,,,,,,,,,,,,,,,,,,,,,,,,,,,,,,,Turner,https://omeka.lib.jmu.edu/erp/files/original/bfe021868c2aea1bc60bc559b472a4f1.pdf,Text,"Rappahannock County SNP Records: Court Proceedings",1,0
