﻿"Item Id","Item URI","Dublin Core:Alternative Title","Dublin Core:Abstract","Dublin Core:Table Of Contents","Dublin Core:Date Available","Dublin Core:Date Created","Dublin Core:Date Accepted","Dublin Core:Date Copyrighted","Dublin Core:Date Submitted","Dublin Core:Date Issued","Dublin Core:Date Modified","Dublin Core:Date Valid","Dublin Core:Access Rights","Dublin Core:License","Dublin Core:Conforms To","Dublin Core:Has Format","Dublin Core:Has Part","Dublin Core:Has Version","Dublin Core:Is Format Of","Dublin Core:Is Part Of","Dublin Core:Is Referenced By","Dublin Core:Is Replaced By","Dublin Core:Is Required By","Dublin Core:Is Version Of","Dublin Core:References","Dublin Core:Replaces","Dublin Core:Requires","Dublin Core:Extent","Dublin Core:Medium","Dublin Core:Bibliographic Citation","Dublin Core:Spatial Coverage","Dublin Core:Temporal Coverage","Dublin Core:Accrual Method","Dublin Core:Accrual Periodicity","Dublin Core:Accrual Policy","Dublin Core:Audience","Dublin Core:Audience Education Level","Dublin Core:Mediator","Dublin Core:Instructional Method","Dublin Core:Provenance","Dublin Core:Rights Holder","Dublin Core:Title","Dublin Core:Subject","Dublin Core:Description","Dublin Core:Creator","Dublin Core:Source","Dublin Core:Publisher","Dublin Core:Date","Dublin Core:Contributor","Dublin Core:Rights","Dublin Core:Relation","Dublin Core:Format","Dublin Core:Language","Dublin Core:Type","Dublin Core:Identifier","Dublin Core:Coverage","Item Type Metadata:Text","Item Type Metadata:Interviewer","Item Type Metadata:Interviewee","Item Type Metadata:Location","Item Type Metadata:Transcription","Item Type Metadata:Local URL","Item Type Metadata:Original Format","Item Type Metadata:Physical Dimensions","Item Type Metadata:Duration","Item Type Metadata:Compression","Item Type Metadata:Producer","Item Type Metadata:Director","Item Type Metadata:Bit Rate/Frequency","Item Type Metadata:Time Summary","Item Type Metadata:Email Body","Item Type Metadata:Subject Line","Item Type Metadata:From","Item Type Metadata:To","Item Type Metadata:CC","Item Type Metadata:BCC","Item Type Metadata:Number of Attachments","Item Type Metadata:Standards","Item Type Metadata:Objectives","Item Type Metadata:Materials","Item Type Metadata:Lesson Plan Text","Item Type Metadata:URL","Item Type Metadata:Event Type","Item Type Metadata:Participants","Item Type Metadata:Birth Date","Item Type Metadata:Birthplace","Item Type Metadata:Death Date","Item Type Metadata:Occupation","Item Type Metadata:Biographical Text","Item Type Metadata:Bibliography","Item Type Metadata:Player","Item Type Metadata:Episode","Item Type Metadata:Season","Item Type Metadata:Episode Type","Item Type Metadata:Explicit","Item Type Metadata:Block","PDF Text:Text",tags,file,itemType,collection,public,featured
4188,https://omeka.lib.jmu.edu/erp/items/show/4188,,,,,,,,,,,,,,,,,,,,,,,,,,,,,,,,,,,,,,,,,"Indenture of Apprenticeship, Rachel Safly to Martin Shoemaker ",,"sewing, knitting, spinning ","Overseers of the Poor",,"JMU Libraries ",1791,,"This work has been identified as being free of known restrictions under copyright law, including all related and neighboring rights. (<a href=""https://creativecommons.org/publicdomain/mark/1.0/"">https://creativecommons.org/publicdomain/mark/1.0/</a>)",,"PDF ",,,Osp003_001_015,,,,,,,,,,,,,,,,,,,,,,,,,,,,,,,,,,,,,,,,,,,"Safly,Shoemaker","https://omeka.lib.jmu.edu/erp/files/original/0b08c8de6a55b5a7931305648b06c063.pdf,https://omeka.lib.jmu.edu/erp/files/original/c3563adc4cd69741533ca56da9513966.pdf",Text,"Overseers of the Poor: Indentures of Apprenticeship",1,0
4235,https://omeka.lib.jmu.edu/erp/items/show/4235,,,,,,,,,,,,,,,,,,,,,,,,,,,,,,,,,,,,,,,,,"Indenture of Apprenticeship, Rachel Blizzerd to Ferdenand Lair ",,"sewing, knitting, spinning ","Overseers of the Poor",,"JMU Libraries ",1808,,"This work has been identified as being free of known restrictions under copyright law, including all related and neighboring rights. (<a href=""https://creativecommons.org/publicdomain/mark/1.0/"">https://creativecommons.org/publicdomain/mark/1.0/</a>)",,"PDF ",,,Osp003_001_062,,,,,,,,,,,,,,,,,,,,,,,,,,,,,,,,,,,,,,,,,,,"Blizzerd,Lair","https://omeka.lib.jmu.edu/erp/files/original/4608a994170ea0e852a403cece5ddc48.pdf,https://omeka.lib.jmu.edu/erp/files/original/9d3100296b358c82e099d88b5446c740.pdf",Text,"Overseers of the Poor: Indentures of Apprenticeship",1,0
4331,https://omeka.lib.jmu.edu/erp/items/show/4331,,,,,,,,,,,,,,,,,,,,,,,,,,,,,,,,,,,,,,,,,"Indenture of Apprenticeship, Preston Fletcher to Paul Custer ",,"farmer ","Overseers of the Poor",,"JMU Libraries ",1823,,"This work has been identified as being free of known restrictions under copyright law, including all related and neighboring rights. (<a href=""https://creativecommons.org/publicdomain/mark/1.0/"">https://creativecommons.org/publicdomain/mark/1.0/</a>)",,"PDF ",,,Osp003_003_044,,,,,,,,,,,,,,,,,,,,,,,,,,,,,,,,,,,,,,,,,,,"Custer,Fletcher",https://omeka.lib.jmu.edu/erp/files/original/a66860b8aad722b774690a6d4165cf30.pdf,Text,"Overseers of the Poor: Indentures of Apprenticeship",1,0
4391,https://omeka.lib.jmu.edu/erp/items/show/4391,,,,,,,,,,,,,,,,,,,,,,,,,,,,,,,,,,,,,,,,,"Indenture of Apprenticeship, Preston Brown to Samuel Coots ",,farmer,"Overseers of the Poor",,"JMU Libraries ",1830,,"This work has been identified as being free of known restrictions under copyright law, including all related and neighboring rights. (<a href=""https://creativecommons.org/publicdomain/mark/1.0/"">https://creativecommons.org/publicdomain/mark/1.0/</a>)",,"PDF ",,,Osp003_004_039,,,,,,,,,,,,,,,,,,,,,,,,,,,,,,,,,,,,,,,,,,,"Brown,Coots",https://omeka.lib.jmu.edu/erp/files/original/98452dce5f6214eb5f739c531fe5bdd0.pdf,Text,"Overseers of the Poor: Indentures of Apprenticeship",1,0
4285,https://omeka.lib.jmu.edu/erp/items/show/4285,,,,,,,,,,,,,,,,,,,,,,,,,,,,,,,,,,,,,,,,,"Indenture of Apprenticeship, Presley to Michael Whitmore ",,"African American, Miller","Overseers of the Poor",,"JMU Libraries ",1817,,"This work has been identified as being free of known restrictions under copyright law, including all related and neighboring rights. (<a href=""https://creativecommons.org/publicdomain/mark/1.0/"">https://creativecommons.org/publicdomain/mark/1.0/</a>)",,"PDF ",,,Osp003_002_042,,,,,,,,,,,,,,,,,,,,,,,,,,,,,,,,,,,,,,,,,,,Whitmore,"https://omeka.lib.jmu.edu/erp/files/original/f628781f41b3f2b05ed3eaeccb8b596c.pdf,https://omeka.lib.jmu.edu/erp/files/original/9d597ebee393f0af350bcca424202cb3.pdf",Text,"Overseers of the Poor: Indentures of Apprenticeship",1,0
4243,https://omeka.lib.jmu.edu/erp/items/show/4243,,,,,,,,,,,,,,,,,,,,,,,,,,,,,,,,,,,,,,,,,"Indenture of Apprenticeship, Presley to Adam Rader ",,"African American, Weaver","Overseers of the Poor",,"JMU Libraries ",1809,,"This work has been identified as being free of known restrictions under copyright law, including all related and neighboring rights. (<a href=""https://creativecommons.org/publicdomain/mark/1.0/"">https://creativecommons.org/publicdomain/mark/1.0/</a>)",,"PDF ",,,Osp003_001_070,,,,,,,,,,,,,,,,,,,,,,,,,,,,,,,,,,,,,,,,,,,Rader,"https://omeka.lib.jmu.edu/erp/files/original/a491f82071f5dfac1950896468eda5a6.pdf,https://omeka.lib.jmu.edu/erp/files/original/9909f70d5862c0338c8ef1bef7c8909e.pdf",Text,"Overseers of the Poor: Indentures of Apprenticeship",1,0
4254,https://omeka.lib.jmu.edu/erp/items/show/4254,,,,,,,,,,,,,,,,,,,,,,,,,,,,,,,,,,,,,,,,,"Indenture of Apprenticeship, Polly to Mark Newland ",,"sewing, spinning, housewifery","Overseers of the Poor",,"JMU Libraries ",1811,,"This work has been identified as being free of known restrictions under copyright law, including all related and neighboring rights. (<a href=""https://creativecommons.org/publicdomain/mark/1.0/"">https://creativecommons.org/publicdomain/mark/1.0/</a>)",,"PDF ",,,Osp003_002_011,,,,,,,,,,,,,,,,,,,,,,,,,,,,,,,,,,,,,,,,,,,Newland,"https://omeka.lib.jmu.edu/erp/files/original/2c87cd7dcc7827a53430d6f66496ecd5.pdf,https://omeka.lib.jmu.edu/erp/files/original/d247e71e65f21f707a2fe66416c38ab0.pdf",Text,"Overseers of the Poor: Indentures of Apprenticeship",1,0
4498,https://omeka.lib.jmu.edu/erp/items/show/4498,,,,,,,,,,,,,,,,,,,,,,,,,,,,,,,,,,,,,,,,,"Indenture of Apprenticeship, Polly Shoemaker to Levi Hess ",,"sewing, knitting, spinning ","Overseers of the Poor",,"JMU Libraries ",1845,,"This work has been identified as being free of known restrictions under copyright law, including all related and neighboring rights. (<a href=""https://creativecommons.org/publicdomain/mark/1.0/"">https://creativecommons.org/publicdomain/mark/1.0/</a>)",,"PDF ",,,Osp003_006_005,,,,,,,,,,,,,,,,,,,,,,,,,,,,,,,,,,,,,,,,,,,"Hess,Shoemaker","https://omeka.lib.jmu.edu/erp/files/original/595df29f8f2dff4c7f43a7c39eed2884.pdf,https://omeka.lib.jmu.edu/erp/files/original/33a9a9edc7ab6f1f88e47eccd0363916.pdf",Text,"Overseers of the Poor: Indentures of Apprenticeship",1,0
4473,https://omeka.lib.jmu.edu/erp/items/show/4473,,,,,,,,,,,,,,,,,,,,,,,,,,,,,,,,,,,,,,,,,"Indenture of Apprenticeship, Polly Collins to David Steele ",,"African American ","Overseers of the Poor",,"JMU Libraries ",1843,,"This work has been identified as being free of known restrictions under copyright law, including all related and neighboring rights. (<a href=""https://creativecommons.org/publicdomain/mark/1.0/"">https://creativecommons.org/publicdomain/mark/1.0/</a>)",,"PDF ",,,Osp003_005_048,,,,,,,,,,,,,,,,,,,,,,,,,,,,,,,,,,,,,,,,,,,"Collins,Steele",https://omeka.lib.jmu.edu/erp/files/original/f3bdc33484d6e52712a2ec4576c2e497.pdf,Text,"Overseers of the Poor: Indentures of Apprenticeship",1,0
4365,https://omeka.lib.jmu.edu/erp/items/show/4365,,,,,,,,,,,,,,,,,,,,,,,,,,,,,,,,,,,,,,,,,"Indenture of Apprenticeship, Polly Berry to Jacob Stoutemoyer",,"Weaveress ","Overseers of the Poor",,"JMU Libraries ",1827,,"This work has been identified as being free of known restrictions under copyright law, including all related and neighboring rights. (<a href=""https://creativecommons.org/publicdomain/mark/1.0/"">https://creativecommons.org/publicdomain/mark/1.0/</a>)",,"PDF ",,,Osp003_004_014,,,,,,,,,,,,,,,,,,,,,,,,,,,,,,,,,,,,,,,,,,,"Berry,Stoutemoyer",https://omeka.lib.jmu.edu/erp/files/original/41a2ad8163fea8bfcb41c3bd916ddc1a.pdf,Text,"Overseers of the Poor: Indentures of Apprenticeship",1,0
4454,https://omeka.lib.jmu.edu/erp/items/show/4454,,,,,,,,,,,,,,,,,,,,,,,,,,,,,,,,,,,,,,,,,"Indenture of Apprenticeship, Peter Montague to Peachy Rice ",,"Cabinet maker ","Overseers of the Poor",,"JMU Libraries ",1840,,"This work has been identified as being free of known restrictions under copyright law, including all related and neighboring rights. (<a href=""https://creativecommons.org/publicdomain/mark/1.0/"">https://creativecommons.org/publicdomain/mark/1.0/</a>)",,"PDF ",,,Osp003_005_029,,,,,,,,,,,,,,,,,,,,,,,,,,,,,,,,,,,,,,,,,,,"Montague,Rice",https://omeka.lib.jmu.edu/erp/files/original/eab815bcd2ae5f85f5d60d075d0d27c6.pdf,Text,"Overseers of the Poor: Indentures of Apprenticeship",1,0
4205,https://omeka.lib.jmu.edu/erp/items/show/4205,,,,,,,,,,,,,,,,,,,,,,,,,,,,,,,,,,,,,,,,,"Indenture of Apprenticeship, Peter Kendle to John Own ",,"Shoe and boot maker","Overseers of the Poor",,"JMU Libraries ",1796,,"This work has been identified as being free of known restrictions under copyright law, including all related and neighboring rights. (<a href=""https://creativecommons.org/publicdomain/mark/1.0/"">https://creativecommons.org/publicdomain/mark/1.0/</a>)",,"PDF ",,,Osp003_001_032,,,,,,,,,,,,,,,,,,,,,,,,,,,,,,,,,,,,,,,,,,,"Kendle,Own","https://omeka.lib.jmu.edu/erp/files/original/2a63b83b5c6323de58a76cfbd9d246d9.pdf,https://omeka.lib.jmu.edu/erp/files/original/51009b18bf4adbb5f9037d0d90b0f0b4.pdf",Text,"Overseers of the Poor: Indentures of Apprenticeship",1,0
4183,https://omeka.lib.jmu.edu/erp/items/show/4183,,,,,,,,,,,,,,,,,,,,,,,,,,,,,,,,,,,,,,,,,"indenture of Apprenticeship, Peter Brown to Henry Stolp",,"Weaver ","Overseers of the Poor",,"JMU Libraries ",1789,,"This work has been identified as being free of known restrictions under copyright law, including all related and neighboring rights. (<a href=""https://creativecommons.org/publicdomain/mark/1.0/"">https://creativecommons.org/publicdomain/mark/1.0/</a>)",,"PDF ",,,Osp003_001_010,,,,,,,,,,,,,,,,,,,,,,,,,,,,,,,,,,,,,,,,,,,"Brown,Stolp",https://omeka.lib.jmu.edu/erp/files/original/47d17dfa58b5a2bd6f8b8ceb7fcea1b2.pdf,Text,"Overseers of the Poor: Indentures of Apprenticeship",1,0
4231,https://omeka.lib.jmu.edu/erp/items/show/4231,,,,,,,,,,,,,,,,,,,,,,,,,,,,,,,,,,,,,,,,,"Indenture of Apprenticeship, Peggy Boyde to James Craige",,"sewing, knitting, spinning ","Overseers of the Poor",,"JMU Libraries ",1807,,"This work has been identified as being free of known restrictions under copyright law, including all related and neighboring rights. (<a href=""https://creativecommons.org/publicdomain/mark/1.0/"">https://creativecommons.org/publicdomain/mark/1.0/</a>)",,"PDF ",,,Osp003_001_058,,,,,,,,,,,,,,,,,,,,,,,,,,,,,,,,,,,,,,,,,,,"Boyde,Craige","https://omeka.lib.jmu.edu/erp/files/original/61e36a54087dac1b375cb488e718983d.pdf,https://omeka.lib.jmu.edu/erp/files/original/e333b75634af9738b871c3e0704fe912.pdf",Text,"Overseers of the Poor: Indentures of Apprenticeship",1,0
4329,https://omeka.lib.jmu.edu/erp/items/show/4329,,,,,,,,,,,,,,,,,,,,,,,,,,,,,,,,,,,,,,,,,"Indenture of Apprenticeship, Peggey Cummins to George Rhodes ",,"Spinster ","Overseers of the Poor",,"JMU Libraries ",1823,,"This work has been identified as being free of known restrictions under copyright law, including all related and neighboring rights. (<a href=""https://creativecommons.org/publicdomain/mark/1.0/"">https://creativecommons.org/publicdomain/mark/1.0/</a>)",,"PDF ",,,Osp003_003_042,,,,,,,,,,,,,,,,,,,,,,,,,,,,,,,,,,,,,,,,,,,"Cummins,Rhodes",https://omeka.lib.jmu.edu/erp/files/original/fb5c6ffc1c3a19942502e88d90e3d913.pdf,Text,"Overseers of the Poor: Indentures of Apprenticeship",1,0
4241,https://omeka.lib.jmu.edu/erp/items/show/4241,,,,,,,,,,,,,,,,,,,,,,,,,,,,,,,,,,,,,,,,,"Indenture of Apprenticeship, Patsy Dear to William Beland ",,,"Overseers of the Poor",,"JMU Libraries ",1809,,"This work has been identified as being free of known restrictions under copyright law, including all related and neighboring rights. (<a href=""https://creativecommons.org/publicdomain/mark/1.0/"">https://creativecommons.org/publicdomain/mark/1.0/</a>)",,"PDF ",,,Osp003_001_068,,,,,,,,,,,,,,,,,,,,,,,,,,,,,,,,,,,,,,,,,,,"Beland,Dear","https://omeka.lib.jmu.edu/erp/files/original/d7bc727bedba38356b94b2f79d8e2cd3.pdf,https://omeka.lib.jmu.edu/erp/files/original/fb1a74b177f2b5e225882d37896ecda3.pdf",Text,"Overseers of the Poor: Indentures of Apprenticeship",1,0
4220,https://omeka.lib.jmu.edu/erp/items/show/4220,,,,,,,,,,,,,,,,,,,,,,,,,,,,,,,,,,,,,,,,,"Indenture of Apprenticeship, Patrick Raines to Ezekiel Logan ",,"Millwright ","Overseers of the Poor",,"JMU Libraries ",1804,,"This work has been identified as being free of known restrictions under copyright law, including all related and neighboring rights. (<a href=""https://creativecommons.org/publicdomain/mark/1.0/"">https://creativecommons.org/publicdomain/mark/1.0/</a>)",,"PDF ",,,Osp003_001_047,,,,,,,,,,,,,,,,,,,,,,,,,,,,,,,,,,,,,,,,,,,"Logan,Raines","https://omeka.lib.jmu.edu/erp/files/original/5700140f03638eff48d012df86f8a75b.pdf,https://omeka.lib.jmu.edu/erp/files/original/73bdcc3aa755ab3ea21914c00a5510f8.pdf",Text,"Overseers of the Poor: Indentures of Apprenticeship",1,0
4184,https://omeka.lib.jmu.edu/erp/items/show/4184,,,,,,,,,,,,,,,,,,,,,,,,,,,,,,,,,,,,,,,,,"Indenture of Apprenticeship, Norton Gum to William Bryan ",,,"Overseers of the Poor",,"JMU Libraries ",1789,,"This work has been identified as being free of known restrictions under copyright law, including all related and neighboring rights. (<a href=""https://creativecommons.org/publicdomain/mark/1.0/"">https://creativecommons.org/publicdomain/mark/1.0/</a>)",,"PDF ",,,Osp003_001_011,,,,,,,,,,,,,,,,,,,,,,,,,,,,,,,,,,,,,,,,,,,"Bryan,Gum","https://omeka.lib.jmu.edu/erp/files/original/d07190eead4dce1cb66303712d1d03e7.pdf,https://omeka.lib.jmu.edu/erp/files/original/b5be0f72296a2a182921c6f4efd591e4.pdf",Text,"Overseers of the Poor: Indentures of Apprenticeship",1,0
4402,https://omeka.lib.jmu.edu/erp/items/show/4402,,,,,,,,,,,,,,,,,,,,,,,,,,,,,,,,,,,,,,,,,"Indenture of Apprenticeship, Noah Shaver to Joseph Billhimer ",,"farmer ","Overseers of the Poor",,"JMU Libraries ",1831,,"This work has been identified as being free of known restrictions under copyright law, including all related and neighboring rights. (<a href=""https://creativecommons.org/publicdomain/mark/1.0/"">https://creativecommons.org/publicdomain/mark/1.0/</a>)",,"PDF ",,,Osp003_004_050,,,,,,,,,,,,,,,,,,,,,,,,,,,,,,,,,,,,,,,,,,,"Billhimer,Shaver",https://omeka.lib.jmu.edu/erp/files/original/22b0228d19fb55f1e330c476dc1baca2.pdf,Text,"Overseers of the Poor: Indentures of Apprenticeship",1,0
4433,https://omeka.lib.jmu.edu/erp/items/show/4433,,,,,,,,,,,,,,,,,,,,,,,,,,,,,,,,,,,,,,,,,"Indenture of Apprenticeship, Nimrod to Andrew Anderson",,"African American, farmer ","Overseers of the Poor",,"JMU Libraries ",1837,,"This work has been identified as being free of known restrictions under copyright law, including all related and neighboring rights. (<a href=""https://creativecommons.org/publicdomain/mark/1.0/"">https://creativecommons.org/publicdomain/mark/1.0/</a>)",,"PDF ",,,Osp003_005_009,,,,,,,,,,,,,,,,,,,,,,,,,,,,,,,,,,,,,,,,,,,Anderson,https://omeka.lib.jmu.edu/erp/files/original/fd20789360cf5e7a88ee93c32dd07d05.pdf,Text,"Overseers of the Poor: Indentures of Apprenticeship",1,0
