﻿"Item Id","Item URI","Dublin Core:Alternative Title","Dublin Core:Abstract","Dublin Core:Table Of Contents","Dublin Core:Date Available","Dublin Core:Date Created","Dublin Core:Date Accepted","Dublin Core:Date Copyrighted","Dublin Core:Date Submitted","Dublin Core:Date Issued","Dublin Core:Date Modified","Dublin Core:Date Valid","Dublin Core:Access Rights","Dublin Core:License","Dublin Core:Conforms To","Dublin Core:Has Format","Dublin Core:Has Part","Dublin Core:Has Version","Dublin Core:Is Format Of","Dublin Core:Is Part Of","Dublin Core:Is Referenced By","Dublin Core:Is Replaced By","Dublin Core:Is Required By","Dublin Core:Is Version Of","Dublin Core:References","Dublin Core:Replaces","Dublin Core:Requires","Dublin Core:Extent","Dublin Core:Medium","Dublin Core:Bibliographic Citation","Dublin Core:Spatial Coverage","Dublin Core:Temporal Coverage","Dublin Core:Accrual Method","Dublin Core:Accrual Periodicity","Dublin Core:Accrual Policy","Dublin Core:Audience","Dublin Core:Audience Education Level","Dublin Core:Mediator","Dublin Core:Instructional Method","Dublin Core:Provenance","Dublin Core:Rights Holder","Dublin Core:Title","Dublin Core:Subject","Dublin Core:Description","Dublin Core:Creator","Dublin Core:Source","Dublin Core:Publisher","Dublin Core:Date","Dublin Core:Contributor","Dublin Core:Rights","Dublin Core:Relation","Dublin Core:Format","Dublin Core:Language","Dublin Core:Type","Dublin Core:Identifier","Dublin Core:Coverage","Item Type Metadata:Text","Item Type Metadata:Interviewer","Item Type Metadata:Interviewee","Item Type Metadata:Location","Item Type Metadata:Transcription","Item Type Metadata:Local URL","Item Type Metadata:Original Format","Item Type Metadata:Physical Dimensions","Item Type Metadata:Duration","Item Type Metadata:Compression","Item Type Metadata:Producer","Item Type Metadata:Director","Item Type Metadata:Bit Rate/Frequency","Item Type Metadata:Time Summary","Item Type Metadata:Email Body","Item Type Metadata:Subject Line","Item Type Metadata:From","Item Type Metadata:To","Item Type Metadata:CC","Item Type Metadata:BCC","Item Type Metadata:Number of Attachments","Item Type Metadata:Standards","Item Type Metadata:Objectives","Item Type Metadata:Materials","Item Type Metadata:Lesson Plan Text","Item Type Metadata:URL","Item Type Metadata:Event Type","Item Type Metadata:Participants","Item Type Metadata:Birth Date","Item Type Metadata:Birthplace","Item Type Metadata:Death Date","Item Type Metadata:Occupation","Item Type Metadata:Biographical Text","Item Type Metadata:Bibliography","Item Type Metadata:Player","Item Type Metadata:Episode","Item Type Metadata:Season","Item Type Metadata:Episode Type","Item Type Metadata:Explicit","Item Type Metadata:Block","PDF Text:Text",tags,file,itemType,collection,public,featured
6593,https://omeka.lib.jmu.edu/erp/items/show/6593,,,,,,,,,,,,,,,,,,,,,,,,,,,,,,,,,,,,,,,,,"Commonwealth v. J.C. Cartrell",Misdemeanor,"Defendant charged with a misdemeanor.","Rockingham County Criminal Court",,"JMU Libraries",1925,"Jennifer Taylor","This work has been identified as being free of known restrictions under copyright law, including all related and neighboring rights.<br /><a href=""https://creativecommons.org/publicdomain/mark/1.0/"" target=""_blank"" rel=""noreferrer noopener"">https://creativecommons.org/publicdomain/mark/1.0/</a>",,PDF,,,CCR001_009_271,,,,,,,,,,,,,,,,,,,,,,,,,,,,,,,,,,,,,,,,,,,Cartrell,https://omeka.lib.jmu.edu/erp/files/original/Rockingham_County_Criminal_Court_Criminal_Cases/ccr001_009_271-commonwealth-v-jc-cartrell.pdf,Text,"Rockingham County Criminal Court: Criminal Cases",1,1
2799,https://omeka.lib.jmu.edu/erp/items/show/2799,,,,,,,,,,,,,,,,,,,,,,,,,,,,,,,,,,,,,,,,,"Commonwealth v. J.C. Parker",,,,"Rockingham County Circuit Court ","JMU Libraries",1919,"Craig Schaefer, Kayla Heslin, Selena St. Andre","This work has been identified as being free of known restrictions under copyright law, including all related and neighboring rights. (<a href=""https://creativecommons.org/publicdomain/mark/1.0/"" target=""_blank"" rel=""noreferrer noopener"">https://creativecommons.org/publicdomain/mark/1.0/</a>)",,"PDF ",,,RcPr-box1-060,,,,,,,,,,,,,,,,,,,,,,,,,,,,,,,,,,,,,,,,,,,Parker,https://omeka.lib.jmu.edu/erp/files/original/37aee5ca5f11fb95f80536bc44b3c0ff.pdf,Text,"Rockingham County Prohibition Records: Criminal Cases",1,0
3240,https://omeka.lib.jmu.edu/erp/items/show/3240,,,,,,,,,,,,,,,,,,,,,,,,,,,,,,,,,,,,,,,,,"Commonwealth v. J.D. Hawkins","Misdemeanor^^guilty^^operated an automobile under the influence","Misdemeanor; Guilty",,"Rockingham County Circuit Court ","JMU Libraries",1930,"Craig Schaefer, Kayla Heslin, Selena St. Andre","This work has been identified as being free of known restrictions under copyright law, including all related and neighboring rights. (<a href=""https://creativecommons.org/publicdomain/mark/1.0/"" target=""_blank"" rel=""noreferrer noopener"">https://creativecommons.org/publicdomain/mark/1.0/</a>)",,PDF,,,RcPr-box8-048,,,,,,,,,,,,,,,,,,,,,,,,,,,,,,,,,,,,,,,,,,,Hawkins,https://omeka.lib.jmu.edu/erp/files/original/a37a916b50ce13b0b39cbce11fa59a5d.pdf,Text,"Rockingham County Prohibition Records: Criminal Cases",1,0
6592,https://omeka.lib.jmu.edu/erp/items/show/6592,,,,,,,,,,,,,,,,,,,,,,,,,,,,,,,,,,,,,,,,,"Commonwealth v. J.E. Holt",Felony^^Embezzlement,"Defendant charged with felony embezzlement.","Rockingham County Criminal Court",,"JMU Libraries",1912,"Jennifer Taylor","This work has been identified as being free of known restrictions under copyright law, including all related and neighboring rights.<br /><a href=""https://creativecommons.org/publicdomain/mark/1.0/"" target=""_blank"" rel=""noreferrer noopener"">https://creativecommons.org/publicdomain/mark/1.0/</a>",,PDF,,,CCR001_006_199,,,,,,,,,,,,,,,,,,,,,,,,,,,,,,,,,,,,,,,,,,,"Holt,Wittig",https://omeka.lib.jmu.edu/erp/files/original/Rockingham_County_Criminal_Court_Criminal_Cases/ccr001_006_199-commonwealth-v-je-holt.pdf,Text,"Rockingham County Criminal Court: Criminal Cases",1,1
3287,https://omeka.lib.jmu.edu/erp/items/show/3287,,,,,,,,,,,,,,,,,,,,,,,,,,,,,,,,,,,,,,,,,"Commonwealth v. J.E. Young","Misdemeanor^^Information^^keep. posess and store for sale ardent spirits","Misdemeanor; Information",,"Rockingham County Circuit Court ","JMU Libraries",1930,"Craig Schaefer, Kayla Heslin, Selena St. Andre","This work has been identified as being free of known restrictions under copyright law, including all related and neighboring rights. (<a href=""https://creativecommons.org/publicdomain/mark/1.0/"" target=""_blank"" rel=""noreferrer noopener"">https://creativecommons.org/publicdomain/mark/1.0/</a>)",,"PDF ",,,RcPr-box9-013,,,,,,,,,,,,,,,,,,,,,,,,,,,,,,,,,,,,,,,,,,,Young,https://omeka.lib.jmu.edu/erp/files/original/9c95e63e96543db006bb2ce0a6304fa0.pdf,Text,"Rockingham County Prohibition Records: Criminal Cases",1,0
3106,https://omeka.lib.jmu.edu/erp/items/show/3106,,,,,,,,,,,,,,,,,,,,,,,,,,,,,,,,,,,,,,,,,"Commonwealth v. J.F. Shifflett and G.H. Morris","Felony^^Indictment^^manufactured spirits","Felony; Indictment",,"Rockingham County Circuit Court ","JMU Libraries",1927,"Craig Schaefer, Kayla Heslin, Selena St. Andre","This work has been identified as being free of known restrictions under copyright law, including all related and neighboring rights. (<a href=""https://creativecommons.org/publicdomain/mark/1.0/"" target=""_blank"" rel=""noreferrer noopener"">https://creativecommons.org/publicdomain/mark/1.0/</a>)",,"PDF ",,,RcPr-box6-052,,,,,,,,,,,,,,,,,,,,,,,,,,,,,,,,,,,,,,,,,,,"Morris,Shifflett",https://omeka.lib.jmu.edu/erp/files/original/9aa431b2ce4a65d172605d995cb188bc.pdf,Text,"Rockingham County Prohibition Records: Criminal Cases",1,0
2782,https://omeka.lib.jmu.edu/erp/items/show/2782,,,,,,,,,,,,,,,,,,,,,,,,,,,,,,,,,,,,,,,,,"Commonwealth v. J.G. Myers",,,,"Rockingham County Circuit Court ","JMU Libraries",1918,"Craig Schaefer, Kayla Heslin, Selena St. Andre","This work has been identified as being free of known restrictions under copyright law, including all related and neighboring rights. (<a href=""https://creativecommons.org/publicdomain/mark/1.0/"" target=""_blank"" rel=""noreferrer noopener"">https://creativecommons.org/publicdomain/mark/1.0/</a>)",,"PDF ",,,RcPr-box1-043,,,,,,,,,,,,,,,,,,,,,,,,,,,,,,,,,,,,,,,,,,,Myers,https://omeka.lib.jmu.edu/erp/files/original/39c9cee7bc3b17a373809157dc5151c3.pdf,Text,"Rockingham County Prohibition Records: Criminal Cases",1,0
3027,https://omeka.lib.jmu.edu/erp/items/show/3027,,,,,,,,,,,,,,,,,,,,,,,,,,,,,,,,,,,,,,,,,"Commonwealth v. J.H. Smith",Misdemeanor^^Indictment,"Misdemeanor; Indictment",,"Rockingham County Circuit Court ","JMU Libraries",1925,"Craig Schaefer, Kayla Heslin, Selena St. Andre","This work has been identified as being free of known restrictions under copyright law, including all related and neighboring rights. (<a href=""https://creativecommons.org/publicdomain/mark/1.0/"" target=""_blank"" rel=""noreferrer noopener"">https://creativecommons.org/publicdomain/mark/1.0/</a>)",,"PDF ",,,RcPr-box5-029,,,,,,,,,,,,,,,,,,,,,,,,,,,,,,,,,,,,,,,,,,,Smith,https://omeka.lib.jmu.edu/erp/files/original/694d7b5d50acb9d5492abe0d6ac3808b.pdf,Text,"Rockingham County Prohibition Records: Criminal Cases",1,0
2846,https://omeka.lib.jmu.edu/erp/items/show/2846,,,,,,,,,,,,,,,,,,,,,,,,,,,,,,,,,,,,,,,,,"Commonwealth v. J.L. Crabill","Misdemeanor^^Indictment^^manufacture^^sell^^offer^^trasport^^dispense^^advertise^^receive order for ardent spirits^^nickname-pete","Misdemeanor; Indictment",,"Rockingham County Circuit Court ","JMU Libraries",1922,"Craig Schaefer, Kayla Heslin, Selena St. Andre","This work has been identified as being free of known restrictions under copyright law, including all related and neighboring rights. (<a href=""https://creativecommons.org/publicdomain/mark/1.0/"" target=""_blank"" rel=""noreferrer noopener"">https://creativecommons.org/publicdomain/mark/1.0/</a>)",,"PDF ",,,RcPr-box2-027,,,,,,,,,,,,,,,,,,,,,,,,,,,,,,,,,,,,,,,,,,,Crabill,https://omeka.lib.jmu.edu/erp/files/original/630b96d9db8a1491b64d864267db3c3f.pdf,Text,"Rockingham County Prohibition Records: Criminal Cases",1,0
6591,https://omeka.lib.jmu.edu/erp/items/show/6591,,,,,,,,,,,,,,,,,,,,,,,,,,,,,,,,,,,,,,,,,"Commonwealth v. J.M. Klinger",Felony^^Abortion,"Defendant charged with felony abortion.","Rockingham County Criminal Court",,"JMU Libraries",1916,"Jennifer Taylor","This work has been identified as being free of known restrictions under copyright law, including all related and neighboring rights.<br /><a href=""https://creativecommons.org/publicdomain/mark/1.0/"" target=""_blank"" rel=""noreferrer noopener"">https://creativecommons.org/publicdomain/mark/1.0/</a>",,PDF,,,CCR001_007_207,,,,,,,,,,,,,,,,,,,,,,,,,,,,,,,,,,,,,,,,,,,"Houchen,Klinger",https://omeka.lib.jmu.edu/erp/files/original/Rockingham_County_Criminal_Court_Criminal_Cases/ccr001_007_207-commonwealth-v-jm-klinger.pdf,Text,"Rockingham County Criminal Court: Criminal Cases",1,1
6590,https://omeka.lib.jmu.edu/erp/items/show/6590,,,,,,,,,,,,,,,,,,,,,,,,,,,,,,,,,,,,,,,,,"Commonwealth v. J.M. Meane","Report of Sale","Report of sale of vehicle.","Rockingham County Criminal Court",,"JMU Libraries",1923,"Jennifer Taylor","This work has been identified as being free of known restrictions under copyright law, including all related and neighboring rights.<br /><a href=""https://creativecommons.org/publicdomain/mark/1.0/"" target=""_blank"" rel=""noreferrer noopener"">https://creativecommons.org/publicdomain/mark/1.0/</a>",,PDF,,,CCR001_008_248,,,,,,,,,,,,,,,,,,,,,,,,,,,,,,,,,,,,,,,,,,,"Haas,Meane",https://omeka.lib.jmu.edu/erp/files/original/Rockingham_County_Criminal_Court_Criminal_Cases/ccr001_008_248-commonwealth-v-jm-meane.pdf,Text,"Rockingham County Criminal Court: Criminal Cases",1,1
6589,https://omeka.lib.jmu.edu/erp/items/show/6589,,,,,,,,,,,,,,,,,,,,,,,,,,,,,,,,,,,,,,,,,"Commonwealth v. J.R. Althouse",Felony^^Forgery,"Defendant charged with felony forgery.","Rockingham County Criminal Court",,"JMU Libraries",1905,"Jennifer Taylor","This work has been identified as being free of known restrictions under copyright law, including all related and neighboring rights.<br /><a href=""https://creativecommons.org/publicdomain/mark/1.0/"" target=""_blank"" rel=""noreferrer noopener"">https://creativecommons.org/publicdomain/mark/1.0/</a>",,PDF,,,CCR001_004_047,,,,,,,,,,,,,,,,,,,,,,,,,,,,,,,,,,,,,,,,,,,"Althouse,Dixon",https://omeka.lib.jmu.edu/erp/files/original/Rockingham_County_Criminal_Court_Criminal_Cases/ccr001_004_047-commonwealth-v-jr-althouse.pdf,Text,"Rockingham County Criminal Court: Criminal Cases",1,1
6588,https://omeka.lib.jmu.edu/erp/items/show/6588,,,,,,,,,,,,,,,,,,,,,,,,,,,,,,,,,,,,,,,,,"Commonwealth v. J.R. Barton","Felony^^Attempted Murder","Defendant charged with felony attempted murder.","Rockingham County Criminal Court",,"JMU Libraries",1912,"Jennifer Taylor","This work has been identified as being free of known restrictions under copyright law, including all related and neighboring rights.<br /><a href=""https://creativecommons.org/publicdomain/mark/1.0/"" target=""_blank"" rel=""noreferrer noopener"">https://creativecommons.org/publicdomain/mark/1.0/</a>",,PDF,,,CCR001_006_192,,,,,,,,,,,,,,,,,,,,,,,,,,,,,,,,,,,,,,,,,,,"Barton,Rhodes",https://omeka.lib.jmu.edu/erp/files/original/Rockingham_County_Criminal_Court_Criminal_Cases/ccr001_006_192-commonwealth-v-jr-barton.pdf,Text,"Rockingham County Criminal Court: Criminal Cases",1,1
3123,https://omeka.lib.jmu.edu/erp/items/show/3123,,,,,,,,,,,,,,,,,,,,,,,,,,,,,,,,,,,,,,,,,"Commonwealth v. J.R. Bryan, R.L. Hill, R.G. Lautenslager and J.R. Barde","Misdemeanor^^Indictment^^transportation and posession","Misdemeanor; Indictment",,"Rockingham County Circuit Court ","JMU Libraries",1928,"Craig Schaefer, Kayla Heslin, Selena St. Andre","This work has been identified as being free of known restrictions under copyright law, including all related and neighboring rights. (<a href=""https://creativecommons.org/publicdomain/mark/1.0/"" target=""_blank"" rel=""noreferrer noopener"">https://creativecommons.org/publicdomain/mark/1.0/</a>)",,"PDF ",,,RcPr-box7-014,,,,,,,,,,,,,,,,,,,,,,,,,,,,,,,,,,,,,,,,,,,"Barde,Bryan,Hill,Lautenslager",https://omeka.lib.jmu.edu/erp/files/original/a7713abac63aa2f4bf3f9b57df34e5aa.pdf,Text,"Rockingham County Prohibition Records: Criminal Cases",1,0
3224,https://omeka.lib.jmu.edu/erp/items/show/3224,,,,,,,,,,,,,,,,,,,,,,,,,,,,,,,,,,,,,,,,,"Commonwealth v. J.R. Davis","Misdemeanor^^not guilty^^posession ardent spirits","Misdemeanor; Not Guilty",,"Rockingham County Circuit Court ","JMU Libraries",1930,"Craig Schaefer, Kayla Heslin, Selena St. Andre","This work has been identified as being free of known restrictions under copyright law, including all related and neighboring rights. (<a href=""https://creativecommons.org/publicdomain/mark/1.0/"" target=""_blank"" rel=""noreferrer noopener"">https://creativecommons.org/publicdomain/mark/1.0/</a>)",,PDF,,,RcPr-box8-032,,,,,,,,,,,,,,,,,,,,,,,,,,,,,,,,,,,,,,,,,,,Davis,https://omeka.lib.jmu.edu/erp/files/original/f479a4a5e089afc878fa8c2e7328b4c7.pdf,Text,"Rockingham County Prohibition Records: Criminal Cases",1,0
6587,https://omeka.lib.jmu.edu/erp/items/show/6587,,,,,,,,,,,,,,,,,,,,,,,,,,,,,,,,,,,,,,,,,"Commonwealth v. J.R. Foley","Misdemeanor^^Verbal Abuse","Defendant charged with misdemeanor verbal abuse.","Rockingham County Criminal Court",,"JMU Libraries",1900,"Jennifer Taylor","This work has been identified as being free of known restrictions under copyright law, including all related and neighboring rights.<br /><a href=""https://creativecommons.org/publicdomain/mark/1.0/"" target=""_blank"" rel=""noreferrer noopener"">https://creativecommons.org/publicdomain/mark/1.0/</a>",,PDF,,,CCR001_003_007,,,,,,,,,,,,,,,,,,,,,,,,,,,,,,,,,,,,,,,,,,,"Foley,Showalter",https://omeka.lib.jmu.edu/erp/files/original/Rockingham_County_Criminal_Court_Criminal_Cases/ccr001_003_007-commonwealth-v-jr-foley.pdf,Text,"Rockingham County Criminal Court: Criminal Cases",1,1
6586,https://omeka.lib.jmu.edu/erp/items/show/6586,,,,,,,,,,,,,,,,,,,,,,,,,,,,,,,,,,,,,,,,,"Commonwealth v. J.R. Hayden",Felony^^Manslaughter,"Defendant charged with felony manslaughter.","Rockingham County Criminal Court",,"JMU Libraries",1930,"Jennifer Taylor","This work has been identified as being free of known restrictions under copyright law, including all related and neighboring rights.<br /><a href=""https://creativecommons.org/publicdomain/mark/1.0/"" target=""_blank"" rel=""noreferrer noopener"">https://creativecommons.org/publicdomain/mark/1.0/</a>",,PDF,,,CCR001_010_320,,,,,,,,,,,,,,,,,,,,,,,,,,,,,,,,,,,,,,,,,,,,https://omeka.lib.jmu.edu/erp/files/original/Rockingham_County_Criminal_Court_Criminal_Cases/ccr001_010_320-commonwealth-v-jr-hayden.pdf,Text,"Rockingham County Criminal Court: Criminal Cases",1,1
8421,https://omeka.lib.jmu.edu/erp/items/show/8421,,,,,,,,,,,,,,,,,,,,,,,,,,,,,,,,,,,,,,,,,"Commonwealth v. J.R. Hayden",Felony^^Murder,"Defendant charged with felony murder.",,,"JMU Libraries",1931,,"This work has been identified as being free of known restrictions under copyright law, including all related and neighboring rights.<br /><a href=""https://creativecommons.org/publicdomain/mark/1.0/"" target=""_blank"" rel=""noreferrer noopener"">https://creativecommons.org/publicdomain/mark/1.0/</a>",,PDF,,,CCR001_011_003,,,,,,,,,,,,,,,,,,,,,,,,,,,,,,,,,,,,,,,,,,,"Ferree,Hayden",https://omeka.lib.jmu.edu/erp/files/original/Rockingham_County_Criminal_Court_Criminal_Cases/ccr001_011_003-commonwealth-v-j-r-hayden.pdf,Text,"Rockingham County Criminal Court: Criminal Cases",1,0
3069,https://omeka.lib.jmu.edu/erp/items/show/3069,,,,,,,,,,,,,,,,,,,,,,,,,,,,,,,,,,,,,,,,,"Commonwealth v. J.W. Andrews and Annie Andrews","Misdemeanor^^guilty^^Ford Roadster^^transport and posession","Misdemeanor; Guilty",,"Rockingham County Circuit Court ","JMU Libraries",1927,"Craig Schaefer, Kayla Heslin, Selena St. Andre","This work has been identified as being free of known restrictions under copyright law, including all related and neighboring rights. (<a href=""https://creativecommons.org/publicdomain/mark/1.0/"" target=""_blank"" rel=""noreferrer noopener"">https://creativecommons.org/publicdomain/mark/1.0/</a>)",,"PDF ",,,RcPr-box6-015,,,,,,,,,,,,,,,,,,,,,,,,,,,,,,,,,,,,,,,,,,,Andrews,https://omeka.lib.jmu.edu/erp/files/original/a262a51e338c2ea7675627ceaeb99f58.pdf,Text,"Rockingham County Prohibition Records: Criminal Cases",1,0
2893,https://omeka.lib.jmu.edu/erp/items/show/2893,,,,,,,,,,,,,,,,,,,,,,,,,,,,,,,,,,,,,,,,,"Commonwealth v. J.W. Javins","Misdemeanor^^guilty^^Chemical Analysis^^report of contraband^^manufacture^^sell^^offer^^transport^^dispense^^advertise^^receive order for ardent spirits","Misdemeanor; Guilty",,"Rockingham County Circuit Court ","JMU Libraries",1923,"Craig Schaefer, Kayla Heslin, Selena St. Andre","This work has been identified as being free of known restrictions under copyright law, including all related and neighboring rights. (<a href=""https://creativecommons.org/publicdomain/mark/1.0/"" target=""_blank"" rel=""noreferrer noopener"">https://creativecommons.org/publicdomain/mark/1.0/</a>)",,PDF,,,RcPr-box3-017,,,,,,,,,,,,,,,,,,,,,,,,,,,,,,,,,,,,,,,,,,,Javins,https://omeka.lib.jmu.edu/erp/files/original/1ad617e4b1e3a57f0f5ee2b17f0b51d9.pdf,Text,"Rockingham County Prohibition Records: Criminal Cases",1,0
