﻿"Item Id","Item URI","Dublin Core:Alternative Title","Dublin Core:Abstract","Dublin Core:Table Of Contents","Dublin Core:Date Available","Dublin Core:Date Created","Dublin Core:Date Accepted","Dublin Core:Date Copyrighted","Dublin Core:Date Submitted","Dublin Core:Date Issued","Dublin Core:Date Modified","Dublin Core:Date Valid","Dublin Core:Access Rights","Dublin Core:License","Dublin Core:Conforms To","Dublin Core:Has Format","Dublin Core:Has Part","Dublin Core:Has Version","Dublin Core:Is Format Of","Dublin Core:Is Part Of","Dublin Core:Is Referenced By","Dublin Core:Is Replaced By","Dublin Core:Is Required By","Dublin Core:Is Version Of","Dublin Core:References","Dublin Core:Replaces","Dublin Core:Requires","Dublin Core:Extent","Dublin Core:Medium","Dublin Core:Bibliographic Citation","Dublin Core:Spatial Coverage","Dublin Core:Temporal Coverage","Dublin Core:Accrual Method","Dublin Core:Accrual Periodicity","Dublin Core:Accrual Policy","Dublin Core:Audience","Dublin Core:Audience Education Level","Dublin Core:Mediator","Dublin Core:Instructional Method","Dublin Core:Provenance","Dublin Core:Rights Holder","Dublin Core:Title","Dublin Core:Subject","Dublin Core:Description","Dublin Core:Creator","Dublin Core:Source","Dublin Core:Publisher","Dublin Core:Date","Dublin Core:Contributor","Dublin Core:Rights","Dublin Core:Relation","Dublin Core:Format","Dublin Core:Language","Dublin Core:Type","Dublin Core:Identifier","Dublin Core:Coverage","Item Type Metadata:Text","Item Type Metadata:Interviewer","Item Type Metadata:Interviewee","Item Type Metadata:Location","Item Type Metadata:Transcription","Item Type Metadata:Local URL","Item Type Metadata:Original Format","Item Type Metadata:Physical Dimensions","Item Type Metadata:Duration","Item Type Metadata:Compression","Item Type Metadata:Producer","Item Type Metadata:Director","Item Type Metadata:Bit Rate/Frequency","Item Type Metadata:Time Summary","Item Type Metadata:Email Body","Item Type Metadata:Subject Line","Item Type Metadata:From","Item Type Metadata:To","Item Type Metadata:CC","Item Type Metadata:BCC","Item Type Metadata:Number of Attachments","Item Type Metadata:Standards","Item Type Metadata:Objectives","Item Type Metadata:Materials","Item Type Metadata:Lesson Plan Text","Item Type Metadata:URL","Item Type Metadata:Event Type","Item Type Metadata:Participants","Item Type Metadata:Birth Date","Item Type Metadata:Birthplace","Item Type Metadata:Death Date","Item Type Metadata:Occupation","Item Type Metadata:Biographical Text","Item Type Metadata:Bibliography","Item Type Metadata:Player","Item Type Metadata:Episode","Item Type Metadata:Season","Item Type Metadata:Episode Type","Item Type Metadata:Explicit","Item Type Metadata:Block","PDF Text:Text",tags,file,itemType,collection,public,featured
6485,https://omeka.lib.jmu.edu/erp/items/show/6485,,,,,,,,,,,,,,,,,,,,,,,,,,,,,,,,,,,,,,,,,"Commonwealth v. Reuben Hensley",Felony^^Theft,"Defendant charged with felony theft.","Rockingham County Criminal Court",,"JMU Libraries",1908,"Jennifer Taylor","This work has been identified as being free of known restrictions under copyright law, including all related and neighboring rights.<br /><a href=""https://creativecommons.org/publicdomain/mark/1.0/"" target=""_blank"" rel=""noreferrer noopener"">https://creativecommons.org/publicdomain/mark/1.0/</a>",,PDF,,,CCR001_005_119,,,,,,,,,,,,,,,,,,,,,,,,,,,,,,,,,,,,,,,,,,,"Hensley,Wright",https://omeka.lib.jmu.edu/erp/files/original/Rockingham_County_Criminal_Court_Criminal_Cases/ccr001_005_119-commonwealth-v-reuben-hensley.pdf,Text,"Rockingham County Criminal Court: Criminal Cases",1,1
3100,https://omeka.lib.jmu.edu/erp/items/show/3100,,,,,,,,,,,,,,,,,,,,,,,,,,,,,,,,,,,,,,,,,"Commonwealth v. Reuben Roadcap, Z.R. Raines and John R. Raines","Felony^^not guilty^^Raines found not guilty^^manufacturing spirits","Felony; Not Guilty",,"Rockingham County Circuit Court ","JMU Libraries",1927,"Craig Schaefer, Kayla Heslin, Selena St. Andre","This work has been identified as being free of known restrictions under copyright law, including all related and neighboring rights. (<a href=""https://creativecommons.org/publicdomain/mark/1.0/"" target=""_blank"" rel=""noreferrer noopener"">https://creativecommons.org/publicdomain/mark/1.0/</a>)",,"PDF ",,,RcPr-box6-046,,,,,,,,,,,,,,,,,,,,,,,,,,,,,,,,,,,,,,,,,,,"Raines,Roadcap",https://omeka.lib.jmu.edu/erp/files/original/72fe6e308f814354310606754061eb3d.pdf,Text,"Rockingham County Prohibition Records: Criminal Cases",1,0
3213,https://omeka.lib.jmu.edu/erp/items/show/3213,,,,,,,,,,,,,,,,,,,,,,,,,,,,,,,,,,,,,,,,,"Commonwealth v. Richard Bowers","Felony^^guilty^^transport^^carrying firearm","Felony; Guilty",,"Rockingham County Circuit Court ","JMU Libraries",1930,"Craig Schaefer, Kayla Heslin, Selena St. Andre","This work has been identified as being free of known restrictions under copyright law, including all related and neighboring rights. (<a href=""https://creativecommons.org/publicdomain/mark/1.0/"" target=""_blank"" rel=""noreferrer noopener"">https://creativecommons.org/publicdomain/mark/1.0/</a>)",,PDF,,,RcPr-box8-021,,,,,,,,,,,,,,,,,,,,,,,,,,,,,,,,,,,,,,,,,,,Bowers,https://omeka.lib.jmu.edu/erp/files/original/5cc2d4df1ee22c375bb762d2eb361788.pdf,Text,"Rockingham County Prohibition Records: Criminal Cases",1,0
6484,https://omeka.lib.jmu.edu/erp/items/show/6484,,,,,,,,,,,,,,,,,,,,,,,,,,,,,,,,,,,,,,,,,"Commonwealth v. Richard Bowers","Felony^^Burglary^^Break and Enter^^Larceny","Defendant charged with felony break and enter and felony larceny.","Rockingham County Criminal Court",,"JMU Libraries",1928,"Jennifer Taylor","This work has been identified as being free of known restrictions under copyright law, including all related and neighboring rights.<br /><a href=""https://creativecommons.org/publicdomain/mark/1.0/"" target=""_blank"" rel=""noreferrer noopener"">https://creativecommons.org/publicdomain/mark/1.0/</a>",,PDF,,,CCR001_010_303,,,,,,,,,,,,,,,,,,,,,,,,,,,,,,,,,,,,,,,,,,,"Bowers,Via",https://omeka.lib.jmu.edu/erp/files/original/Rockingham_County_Criminal_Court_Criminal_Cases/ccr001_010_303-commonwealth-v-richard-bowers.pdf,Text,"Rockingham County Criminal Court: Criminal Cases",1,1
8363,https://omeka.lib.jmu.edu/erp/items/show/8363,,,,,,,,,,,,,,,,,,,,,,,,,,,,,,,,,,,,,,,,,"Commonwealth v. Richard Donovan","Felony^^Assault and Battery","Defendant charged with felony assault and battery. ",,,"JMU LIbraries",1894,"Jennifer Taylor","This work has been identified as being free of known restrictions under copyright law, including all related and neighboring rights.<br /><a href=""https://creativecommons.org/publicdomain/mark/1.0/"" target=""_blank"" rel=""noreferrer noopener"">https://creativecommons.org/publicdomain/mark/1.0/</a>",,PDF,,,CCR001_002_012,,,,,,,,,,,,,,,,,,,,,,,,,,,,,,,,,,,,,,,,,,,"Donovan,Fultz",https://omeka.lib.jmu.edu/erp/files/original/Rockingham_County_Criminal_Court_Criminal_Cases/ccr001_002_012-commonwealth-v-richard-donovan.pdf,Text,"Rockingham County Criminal Court: Criminal Cases",1,0
8362,https://omeka.lib.jmu.edu/erp/items/show/8362,,,,,,,,,,,,,,,,,,,,,,,,,,,,,,,,,,,,,,,,,"Commonwealth v. Richard Hussey and Abraham Paul","Felony^^Assault and Battery","Defendant charged with felony assault and battery. ",,,"JMU LIbraries",1899,"Jennifer Taylor","This work has been identified as being free of known restrictions under copyright law, including all related and neighboring rights.<br /><a href=""https://creativecommons.org/publicdomain/mark/1.0/"" target=""_blank"" rel=""noreferrer noopener"">https://creativecommons.org/publicdomain/mark/1.0/</a>",,PDF,,,CCR001_002_043,,,,,,,,,,,,,,,,,,,,,,,,,,,,,,,,,,,,,,,,,,,"Dearers,Hussey,Paul",https://omeka.lib.jmu.edu/erp/files/original/Rockingham_County_Criminal_Court_Criminal_Cases/ccr001_002_043-commonwealth-v-richard-hussey-abraham-paul.pdf,Text,"Rockingham County Criminal Court: Criminal Cases",1,0
6483,https://omeka.lib.jmu.edu/erp/items/show/6483,,,,,,,,,,,,,,,,,,,,,,,,,,,,,,,,,,,,,,,,,"Commonwealth v. Richard Miller et al. ",Misdemeanor^^Theft,"Defendants charged with misdemeanor theft.","Rockingham County Criminal Court",,"JMU Libraries",1910,"Jennifer Taylor","This work has been identified as being free of known restrictions under copyright law, including all related and neighboring rights.<br /><a href=""https://creativecommons.org/publicdomain/mark/1.0/"" target=""_blank"" rel=""noreferrer noopener"">https://creativecommons.org/publicdomain/mark/1.0/</a>",,PDF,,,CCR001_006_169,,,,,,,,,,,,,,,,,,,,,,,,,,,,,,,,,,,,,,,,,,,"Ford,Frank,Gordon,Miller,Reedy,Whitmer",https://omeka.lib.jmu.edu/erp/files/original/Rockingham_County_Criminal_Court_Criminal_Cases/ccr001_006_169-commonwealth-v-richard-miller-et-al-.pdf,Text,"Rockingham County Criminal Court: Criminal Cases",1,1
6482,https://omeka.lib.jmu.edu/erp/items/show/6482,,,,,,,,,,,,,,,,,,,,,,,,,,,,,,,,,,,,,,,,,"Commonwealth v. Richard Morris",Misdemeanor^^Cohabitation,"Defendant charged with misdemeanor cohabitation.","Rockingham County Criminal Court",,"JMU Libraries",1909,"Jennifer Taylor","This work has been identified as being free of known restrictions under copyright law, including all related and neighboring rights.<br /><a href=""https://creativecommons.org/publicdomain/mark/1.0/"" target=""_blank"" rel=""noreferrer noopener"">https://creativecommons.org/publicdomain/mark/1.0/</a>",,PDF,,,CCR001_005_148,,,,,,,,,,,,,,,,,,,,,,,,,,,,,,,,,,,,,,,,,,,"Knight,Morris",https://omeka.lib.jmu.edu/erp/files/original/Rockingham_County_Criminal_Court_Criminal_Cases/ccr001_005_148-commonwealth-v-richard-morris.pdf,Text,"Rockingham County Criminal Court: Criminal Cases",1,1
3222,https://omeka.lib.jmu.edu/erp/items/show/3222,,,,,,,,,,,,,,,,,,,,,,,,,,,,,,,,,,,,,,,,,"Commonwealth v. Riley Crawford","Misdemeanor^^Indictment^^operated an automobile under the influence","Misdemeanor; Indictment",,"Rockingham County Circuit Court ","JMU Libraries",1930,"Craig Schaefer, Kayla Heslin, Selena St. Andre","This work has been identified as being free of known restrictions under copyright law, including all related and neighboring rights. (<a href=""https://creativecommons.org/publicdomain/mark/1.0/"" target=""_blank"" rel=""noreferrer noopener"">https://creativecommons.org/publicdomain/mark/1.0/</a>)",,PDF,,,RcPr-box8-030,,,,,,,,,,,,,,,,,,,,,,,,,,,,,,,,,,,,,,,,,,,Crawford,https://omeka.lib.jmu.edu/erp/files/original/feb060004a72abb3e19bb823b6bea677.pdf,Text,"Rockingham County Prohibition Records: Criminal Cases",1,0
6481,https://omeka.lib.jmu.edu/erp/items/show/6481,,,,,,,,,,,,,,,,,,,,,,,,,,,,,,,,,,,,,,,,,"Commonwealth v. Rives Tatum","Felony^^Practice Medicine without a License","Defendant charged with felony practice medicine without a license.","Rockingham County Criminal Court",,"JMU Libraries",1905,"Jennifer Taylor","This work has been identified as being free of known restrictions under copyright law, including all related and neighboring rights.<br /><a href=""https://creativecommons.org/publicdomain/mark/1.0/"" target=""_blank"" rel=""noreferrer noopener"">https://creativecommons.org/publicdomain/mark/1.0/</a>",,PDF,,,CCR001_004_061,,,,,,,,,,,,,,,,,,,,,,,,,,,,,,,,,,,,,,,,,,,Tatum,https://omeka.lib.jmu.edu/erp/files/original/Rockingham_County_Criminal_Court_Criminal_Cases/ccr001_004_061-commonwealth-v-rives-tatum.pdf,Text,"Rockingham County Criminal Court: Criminal Cases",1,1
3068,https://omeka.lib.jmu.edu/erp/items/show/3068,,,,,,,,,,,,,,,,,,,,,,,,,,,,,,,,,,,,,,,,,"Commonwealth v. Robert Alexander","Felony^^guilty^^manufacture distilled ardent spirits","Felony; Guilty",,"Rockingham County Circuit Court ","JMU Libraries",1927,"Craig Schaefer, Kayla Heslin, Selena St. Andre","This work has been identified as being free of known restrictions under copyright law, including all related and neighboring rights. (<a href=""https://creativecommons.org/publicdomain/mark/1.0/"" target=""_blank"" rel=""noreferrer noopener"">https://creativecommons.org/publicdomain/mark/1.0/</a>)",,"PDF ",,,RcPr-box6-014,,,,,,,,,,,,,,,,,,,,,,,,,,,,,,,,,,,,,,,,,,,Alexander,https://omeka.lib.jmu.edu/erp/files/original/462c1c7e9e3768b115a9bbf4dd049e88.pdf,Text,"Rockingham County Prohibition Records: Criminal Cases",1,0
6480,https://omeka.lib.jmu.edu/erp/items/show/6480,,,,,,,,,,,,,,,,,,,,,,,,,,,,,,,,,,,,,,,,,"Commonwealth v. Robert Baldwin",Felony^^Manslaughter,"Defendant charged with felony manslaughter.","Rockingham County Criminal Court",,"JMU Libraries",1929,"Jennifer Taylor","This work has been identified as being free of known restrictions under copyright law, including all related and neighboring rights.<br /><a href=""https://creativecommons.org/publicdomain/mark/1.0/"" target=""_blank"" rel=""noreferrer noopener"">https://creativecommons.org/publicdomain/mark/1.0/</a>",,PDF,,,CCR001_010_311,,,,,,,,,,,,,,,,,,,,,,,,,,,,,,,,,,,,,,,,,,,"Baldwin,Cullers",https://omeka.lib.jmu.edu/erp/files/original/Rockingham_County_Criminal_Court_Criminal_Cases/ccr001_010_311-commonwealth-v-robert-baldwin.pdf,Text,"Rockingham County Criminal Court: Criminal Cases",1,1
8361,https://omeka.lib.jmu.edu/erp/items/show/8361,,,,,,,,,,,,,,,,,,,,,,,,,,,,,,,,,,,,,,,,,"Commonwealth v. Robert Craig and Laura Lam",Felony^^Extortion,"Defendant charged with felony extortion. ",,,"JMU Libraries",1932,,"This work has been identified as being free of known restrictions under copyright law, including all related and neighboring rights.<br /><a href=""https://creativecommons.org/publicdomain/mark/1.0/"" target=""_blank"" rel=""noreferrer noopener"">https://creativecommons.org/publicdomain/mark/1.0/</a>",,PDF,,,CCR001_012_003,,,,,,,,,,,,,,,,,,,,,,,,,,,,,,,,,,,,,,,,,,,"Craig,Lam,Williams",https://omeka.lib.jmu.edu/erp/files/original/Rockingham_County_Criminal_Court_Criminal_Cases/ccr001_012_003-commonwealth-v-robert-craig-and-laura-lam.pdf,Text,"Rockingham County Criminal Court: Criminal Cases",1,0
2879,https://omeka.lib.jmu.edu/erp/items/show/2879,,,,,,,,,,,,,,,,,,,,,,,,,,,,,,,,,,,,,,,,,"Commonwealth v. Robert Crawford and Kemper Crawford","Misdemeanor^^guilty^^posession of a still^^manufacture^^sell^^offer^^transport^^dispense^^advertise^^receive order for ardent spirits","Misdemeanor; Guilty",,"Rockingham County Circuit Court ","JMU Libraries",1923,"Craig Schaefer, Kayla Heslin, Selena St. Andre","This work has been identified as being free of known restrictions under copyright law, including all related and neighboring rights. (<a href=""https://creativecommons.org/publicdomain/mark/1.0/"" target=""_blank"" rel=""noreferrer noopener"">https://creativecommons.org/publicdomain/mark/1.0/</a>)",,PDF,,,RcPr-box3-003,,,,,,,,,,,,,,,,,,,,,,,,,,,,,,,,,,,,,,,,,,,Crawford,https://omeka.lib.jmu.edu/erp/files/original/bfe0d5e3869eff0322bb87820c90f78e.pdf,Text,"Rockingham County Prohibition Records: Criminal Cases",1,0
3039,https://omeka.lib.jmu.edu/erp/items/show/3039,,,,,,,,,,,,,,,,,,,,,,,,,,,,,,,,,,,,,,,,,"Commonwealth v. Robert Crawford and Kemper Crawford","Felony^^Indictment^^2 Stills^^manufacturing","Felony; Indictment",,"Rockingham County Circuit Court ","JMU Libraries",1926,"Craig Schaefer, Kayla Heslin, Selena St. Andre","This work has been identified as being free of known restrictions under copyright law, including all related and neighboring rights. (<a href=""https://creativecommons.org/publicdomain/mark/1.0/"" target=""_blank"" rel=""noreferrer noopener"">https://creativecommons.org/publicdomain/mark/1.0/</a>)",,"PDF ",,,RcPr-box5-041,,,,,,,,,,,,,,,,,,,,,,,,,,,,,,,,,,,,,,,,,,,Crawford,https://omeka.lib.jmu.edu/erp/files/original/d3b21c54af3ba1011160f703688a1ef0.pdf,Text,"Rockingham County Prohibition Records: Criminal Cases",1,0
3005,https://omeka.lib.jmu.edu/erp/items/show/3005,,,,,,,,,,,,,,,,,,,,,,,,,,,,,,,,,,,,,,,,,"Commonwealth v. Robert Davis",Misdemeanor^^Indictment,"Misdemeanor; Indictment",,"Rockingham County Circuit Court ","JMU Libraries",1925,"Craig Schaefer, Kayla Heslin, Selena St. Andre","This work has been identified as being free of known restrictions under copyright law, including all related and neighboring rights. (<a href=""https://creativecommons.org/publicdomain/mark/1.0/"" target=""_blank"" rel=""noreferrer noopener"">https://creativecommons.org/publicdomain/mark/1.0/</a>)",,"PDF ",,,RcPr-box5-007,,,,,,,,,,,,,,,,,,,,,,,,,,,,,,,,,,,,,,,,,,,Davis,https://omeka.lib.jmu.edu/erp/files/original/44e981b6fd029baebb46478fd340df19.pdf,Text,"Rockingham County Prohibition Records: Criminal Cases",1,0
6478,https://omeka.lib.jmu.edu/erp/items/show/6478,,,,,,,,,,,,,,,,,,,,,,,,,,,,,,,,,,,,,,,,,"Commonwealth v. Robert Derror","Felony^^Threats of Bodily Harm","Defendant charged with felony threats of bodily harm.","Rockingham County Criminal Court",,"JMU Libraries",1900,"Jennifer Taylor","This work has been identified as being free of known restrictions under copyright law, including all related and neighboring rights.<br /><a href=""https://creativecommons.org/publicdomain/mark/1.0/"" target=""_blank"" rel=""noreferrer noopener"">https://creativecommons.org/publicdomain/mark/1.0/</a>",,PDF,,,CCR001_003_005,,,,,,,,,,,,,,,,,,,,,,,,,,,,,,,,,,,,,,,,,,,"Derror,Glovier",https://omeka.lib.jmu.edu/erp/files/original/Rockingham_County_Criminal_Court_Criminal_Cases/ccr001_003_005-commonwealth-v-robert-derror.pdf,Text,"Rockingham County Criminal Court: Criminal Cases",1,1
6479,https://omeka.lib.jmu.edu/erp/items/show/6479,,,,,,,,,,,,,,,,,,,,,,,,,,,,,,,,,,,,,,,,,"Commonwealth v. Robert Derror","Misdemeanor^^Disorderly conduct","Defendant charged with misdemeanor disorderly conduct.","Rockingham County Criminal Court",,"JMU Libraries",1902,"Jennifer Taylor","This work has been identified as being free of known restrictions under copyright law, including all related and neighboring rights.<br /><a href=""https://creativecommons.org/publicdomain/mark/1.0/"" target=""_blank"" rel=""noreferrer noopener"">https://creativecommons.org/publicdomain/mark/1.0/</a>",,PDF,,,CCR001_003_035,,,,,,,,,,,,,,,,,,,,,,,,,,,,,,,,,,,,,,,,,,,Derror,https://omeka.lib.jmu.edu/erp/files/original/Rockingham_County_Criminal_Court_Criminal_Cases/ccr001_003_035-commonwealth-v-robert-derror.pdf,Text,"Rockingham County Criminal Court: Criminal Cases",1,1
8360,https://omeka.lib.jmu.edu/erp/items/show/8360,,,,,,,,,,,,,,,,,,,,,,,,,,,,,,,,,,,,,,,,,"Commonwealth v. Robert Dessez","Felony^^Involuntary Manslaughter","Defendant charged with felony involuntary manslaughter.",,,"JMU Libraries",1934,,"This work has been identified as being free of known restrictions under copyright law, including all related and neighboring rights.<br /><a href=""https://creativecommons.org/publicdomain/mark/1.0/"" target=""_blank"" rel=""noreferrer noopener"">https://creativecommons.org/publicdomain/mark/1.0/</a>",,PDF,,,CCR001_012_011,,,,,,,,,,,,,,,,,,,,,,,,,,,,,,,,,,,,,,,,,,,"Custer,Dessez",https://omeka.lib.jmu.edu/erp/files/original/Rockingham_County_Criminal_Court_Criminal_Cases/ccr001_012_011-commonwealth-v-robert-dessez.pdf,Text,"Rockingham County Criminal Court: Criminal Cases",1,0
2953,https://omeka.lib.jmu.edu/erp/items/show/2953,,,,,,,,,,,,,,,,,,,,,,,,,,,,,,,,,,,,,,,,,"Commonwealth v. Robert Harman and Frank Harman",Misdemeanor^^Indictment,"Misdemeanor; Indictment",,"Rockingham County Circuit Court ","JMU Libraries",1924,"Craig Schaefer, Kayla Heslin, Selena St. Andre","This work has been identified as being free of known restrictions under copyright law, including all related and neighboring rights. (<a href=""https://creativecommons.org/publicdomain/mark/1.0/"" target=""_blank"" rel=""noreferrer noopener"">https://creativecommons.org/publicdomain/mark/1.0/</a>)",,PDF,,,RcPr-box4-014,,,,,,,,,,,,,,,,,,,,,,,,,,,,,,,,,,,,,,,,,,,Harman,https://omeka.lib.jmu.edu/erp/files/original/d31a6c01b964c840ddedc64c1f8c96b3.pdf,Text,"Rockingham County Prohibition Records: Criminal Cases",1,0
