﻿"Item Id","Item URI","Dublin Core:Alternative Title","Dublin Core:Abstract","Dublin Core:Table Of Contents","Dublin Core:Date Available","Dublin Core:Date Created","Dublin Core:Date Accepted","Dublin Core:Date Copyrighted","Dublin Core:Date Submitted","Dublin Core:Date Issued","Dublin Core:Date Modified","Dublin Core:Date Valid","Dublin Core:Access Rights","Dublin Core:License","Dublin Core:Conforms To","Dublin Core:Has Format","Dublin Core:Has Part","Dublin Core:Has Version","Dublin Core:Is Format Of","Dublin Core:Is Part Of","Dublin Core:Is Referenced By","Dublin Core:Is Replaced By","Dublin Core:Is Required By","Dublin Core:Is Version Of","Dublin Core:References","Dublin Core:Replaces","Dublin Core:Requires","Dublin Core:Extent","Dublin Core:Medium","Dublin Core:Bibliographic Citation","Dublin Core:Spatial Coverage","Dublin Core:Temporal Coverage","Dublin Core:Accrual Method","Dublin Core:Accrual Periodicity","Dublin Core:Accrual Policy","Dublin Core:Audience","Dublin Core:Audience Education Level","Dublin Core:Mediator","Dublin Core:Instructional Method","Dublin Core:Provenance","Dublin Core:Rights Holder","Dublin Core:Title","Dublin Core:Subject","Dublin Core:Description","Dublin Core:Creator","Dublin Core:Source","Dublin Core:Publisher","Dublin Core:Date","Dublin Core:Contributor","Dublin Core:Rights","Dublin Core:Relation","Dublin Core:Format","Dublin Core:Language","Dublin Core:Type","Dublin Core:Identifier","Dublin Core:Coverage","Item Type Metadata:Text","Item Type Metadata:Interviewer","Item Type Metadata:Interviewee","Item Type Metadata:Location","Item Type Metadata:Transcription","Item Type Metadata:Local URL","Item Type Metadata:Original Format","Item Type Metadata:Physical Dimensions","Item Type Metadata:Duration","Item Type Metadata:Compression","Item Type Metadata:Producer","Item Type Metadata:Director","Item Type Metadata:Bit Rate/Frequency","Item Type Metadata:Time Summary","Item Type Metadata:Email Body","Item Type Metadata:Subject Line","Item Type Metadata:From","Item Type Metadata:To","Item Type Metadata:CC","Item Type Metadata:BCC","Item Type Metadata:Number of Attachments","Item Type Metadata:Standards","Item Type Metadata:Objectives","Item Type Metadata:Materials","Item Type Metadata:Lesson Plan Text","Item Type Metadata:URL","Item Type Metadata:Event Type","Item Type Metadata:Participants","Item Type Metadata:Birth Date","Item Type Metadata:Birthplace","Item Type Metadata:Death Date","Item Type Metadata:Occupation","Item Type Metadata:Biographical Text","Item Type Metadata:Bibliography","Item Type Metadata:Player","Item Type Metadata:Episode","Item Type Metadata:Season","Item Type Metadata:Episode Type","Item Type Metadata:Explicit","Item Type Metadata:Block","PDF Text:Text",tags,file,itemType,collection,public,featured
701,https://omeka.lib.jmu.edu/erp/items/show/701,,,,,,,,,,,,,,,,,,,,,,,,,,,,,,,,,,,,,,,,,"Dearing, W. T.",,"Location: S. Naked Creek",,"Dean, S.A.- Fogle, Earl C.","Rockingham County Circuit Courthouse",,"Pake Davis, Tristan Nelson, Liana Bayne","This work has been identified as being free of known restrictions under copyright law, including all related and neighboring rights.&nbsp;(<a href=""https://creativecommons.org/publicdomain/mark/1.0/"" target=""_blank"" rel=""noreferrer"">https://creativecommons.org/publicdomain/mark/1.0/</a>)",,PDF,,,dearing-w-t.pdf,"Tract(s): 21",,,,,,,,,,,,,,,,,,,,,,,,,,,,,,,,,,,,,,,,,,Dearing,https://omeka.lib.jmu.edu/erp/files/original/2f3dc85c614be03e6bdd4183f4c84422.pdf,Text,"Rockingham County SNP Records: Court Proceedings",1,0
6217,https://omeka.lib.jmu.edu/erp/items/show/6217,,,,,,,,,,,,,,,,,,,,,,,,,,,,,,,,,,,,,,,,,"Deatherage Heirs",,"<p><strong>Tract: </strong>42; </p><p><strong>Location: </strong>Battle Run; </p><p><strong>Cost/Acre: </strong>$24.89; </p><p><strong>Estimate Value: </strong>$174.00; </p><p><strong>Number of Acres: </strong>7.0; </p><p><strong>Monies Awarded: </strong>$ (n/a)</p>",,"Rappahannock County Circuit Courthouse","JMU Libraries",,,"<a href=""https://creativecommons.org/licenses/by-nc/4.0/"" target=""_blank"" rel=""noreferrer noopener"">https://creativecommons.org/licenses/by-nc/4.0/</a>",,PDF,,,deatherage-heirs-tract-42,"Tract 42",,,,,,,,,,,,,,,,,,,,,,,,,,,,,,,,,,,,,,,,,,Deatherage,https://omeka.lib.jmu.edu/erp/files/original/3b8d55e0ff70d91f18623766900c3313.pdf,Text,"Rappahannock County SNP Records: Court Proceedings",1,0
6218,https://omeka.lib.jmu.edu/erp/items/show/6218,,,,,,,,,,,,,,,,,,,,,,,,,,,,,,,,,,,,,,,,,"Deatherage Heirs",,"<p><strong>Tract: </strong>42 - A; </p><p><strong>Location: </strong>South side of Battle Run; </p><p><strong>Cost/Acre: </strong>$3.00; </p><p><strong>Estimate Value: </strong>$15.00; </p><p><strong>Number of Acres: </strong>5.0; </p><p><strong>Monies Awarded: </strong>$15.00</p>",,"Rappahannock County Circuit Courthouse","JMU Libraries",,,"<a href=""https://creativecommons.org/licenses/by-nc/4.0/"" target=""_blank"" rel=""noreferrer noopener"">https://creativecommons.org/licenses/by-nc/4.0/</a>",,PDF,,,deatherage-heirs-tract-42-a,"Tract 42 - A",,,,,,,,,,,,,,,,,,,,,,,,,,,,,,,,,,,,,,,,,,Deatherage,https://omeka.lib.jmu.edu/erp/files/original/db4f4123b16cf4149cd2a185d9161e65.pdf,Text,"Rappahannock County SNP Records: Court Proceedings",1,0
6219,https://omeka.lib.jmu.edu/erp/items/show/6219,,,,,,,,,,,,,,,,,,,,,,,,,,,,,,,,,,,,,,,,,"Deatherage Heirs",,"<p><strong>Tract: </strong>42 - B; </p><p><strong>Location: </strong>Battle Run; </p><p><strong>Cost/Acre: </strong>$17.80; </p><p><strong>Estimate Value: </strong>$89.00; </p><p><strong>Number of Acres: </strong>5.0; </p><p><strong>Monies Awarded: </strong>$ (n/a)</p>",,"Rappahannock County Circuit Courthouse","JMU Libraries",,,"<a href=""https://creativecommons.org/licenses/by-nc/4.0/"" target=""_blank"" rel=""noreferrer noopener"">https://creativecommons.org/licenses/by-nc/4.0/</a>",,PDF,,,deatherage-heirs-tract-42-b,"Tract 42 - B",,,,,,,,,,,,,,,,,,,,,,,,,,,,,,,,,,,,,,,,,,Deatherage,https://omeka.lib.jmu.edu/erp/files/original/92b19dcec83cd1cffc7360431f26cd71.pdf,Text,"Rappahannock County SNP Records: Court Proceedings",1,0
4578,https://omeka.lib.jmu.edu/erp/items/show/4578,,,,,,,,,,,,,,,,,,,,,,,,,,,,,,,,,,,,,,,,,"Deed Book",,"<p><strong>Tract: </strong>All tracts</p>",,"Rappahannock County Circuit Courthouse","JMU Libraries",,,"<a href=""https://creativecommons.org/licenses/by-nc/4.0/"" target=""_blank"" rel=""noopener"">https://creativecommons.org/licenses/by-nc/4.0/</a>",,PDF,,,deed-book-all-tracts,"All tracts",,,,,,,,,,,,,,,,,,,,,,,,,,,,,,,,,,,,,,,,,,,https://omeka.lib.jmu.edu/erp/files/original/8c3feece523b3cd431ac408d20f9b145.pdf,Text,"Rappahannock County SNP Records: Muniments of Title",1,0
788,https://omeka.lib.jmu.edu/erp/items/show/788,,,,,,,,,,,,,,,,,,,,,,,,,,,,,,,,,,,,,,,,,"Deed Book 1","""Muniments of Title of the State Commission on Conservation and Development - in and to - Shenandoah National Park Lands Condemned for use as a Public Park and for Public Park Purposes.""","Official legal petition by the State of Virginia to condemn privately held lands in Rockingham County for inclusion within the Shenandoah National Park. Includes all the surveyor descriptions of the tracts of land, names of property owners, additional claims to the tracts, current location of where property owners resided, and plats.",,"Deed Book 159 - Pages 1-140","Rockingham County Circuit Courthouse",,"Pake Davis, Tristan Nelson, Liana Bayne","This work has been identified as being free of known restrictions under copyright law, including all related and neighboring rights. (<a href=""https://creativecommons.org/publicdomain/mark/1.0/"" target=""_blank"">https://creativecommons.org/publicdomain/mark/1.0/</a>)",,PDF,,,deed-book-1.pdf,,,,,,,,,,,,,,,,,,,,,,,,,,,,,,,,,,,,,,,,,,,,https://omeka.lib.jmu.edu/erp/files/original/ec2602681c1a1c1a8083b7abb5eb36e0.pdf,,"Rockingham County SNP Records: Deed Books",1,0
789,https://omeka.lib.jmu.edu/erp/items/show/789,,,,,,,,,,,,,,,,,,,,,,,,,,,,,,,,,,,,,,,,,"Deed Book 2","""Muniments of Title of the State Commission on Conservation and Development - in and to - Shenandoah National Park Lands Condemned for use as a Public Park and for Public Park Purposes.""","Official legal petition by the State of Virginia to condemn privately held lands in Rockingham County for inclusion within the Shenandoah National Park. Includes all the surveyor descriptions of the tracts of land, names of property owners, additional claims to the tracts, current location of where property owners resided, and plats.",,"Deed Book 159 - Pages 141-362","Rockingham County Circuit Courthouse",,"Pake Davis, Tristan Nelson, Liana Bayne","This work has been identified as being free of known restrictions under copyright law, including all related and neighboring rights. (<a href=""https://creativecommons.org/publicdomain/mark/1.0/"" target=""_blank"">https://creativecommons.org/publicdomain/mark/1.0/</a>)",,PDF,,,deed-book-2.pdf,,,,,,,,,,,,,,,,,,,,,,,,,,,,,,,,,,,,,,,,,,,"Deed Book",https://omeka.lib.jmu.edu/erp/files/original/698c20a92aed84b57df2592e01fc0960.pdf,,"Rockingham County SNP Records: Deed Books",1,0
8329,https://omeka.lib.jmu.edu/erp/items/show/8329,,,,,,,,,,,,,,,,,,,,,,,,,,,,,,,,,,,,,,,,,"Deed Book 53",,"Deed Book 53. Muniments of Title. Due to its length, this document has been separated into three parts.",,"Madison County Circuit Courthouse","JMU Libraries",,,"<a href=""http://creativecommons.org/licenses/by-nc/4.0/""></a><br />This work is licensed under a <a href=""http://creativecommons.org/licenses/by-nc/4.0/"">Creative Commons Attribution-NonCommercial 4.0 International License</a>.",,PDF,,,MCSNP_deed-book-53-all-tracts,"All Tracts",,,,,,,,,,,,,,,,,,,,,,,,,,,,,,,,,,,,,,,,,,,"https://omeka.lib.jmu.edu/erp/files/original/Madison_County_SNP_Records_Miscellaneous_Documents/MAD_Deed_Book_53_Madison_County_VA_part-1-of-3.pdf,https://omeka.lib.jmu.edu/erp/files/original/Madison_County_SNP_Records_Miscellaneous_Documents/MAD_Deed_Book_53_Madison_County_VA_part-2-of-3.pdf,https://omeka.lib.jmu.edu/erp/files/original/Madison_County_SNP_Records_Miscellaneous_Documents/MAD_Deed_Book_53_Madison_County_VA_part-3-of-3.pdf",Text,"Madison County SNP Records: Miscellaneous Documents",1,0
6216,https://omeka.lib.jmu.edu/erp/items/show/6216,,,,,,,,,,,,,,,,,,,,,,,,,,,,,,,,,,,,,,,,,"Dejarnette, HM and EH",,"<p><strong>Tract: </strong>57; </p><p><strong>Location: </strong>Near the top of the Peak about 4 miles from Washington, Va; </p><p><strong>Cost/Acre: </strong>$22.82; </p><p><strong>Estimate Value: </strong>$1,186.50; </p><p><strong>Number of Acres: </strong>52.0; </p><p><strong>Monies Awarded: </strong>$1,186.50</p>",,"Rappahannock County Circuit Courthouse","JMU Libraries",,,"<a href=""https://creativecommons.org/licenses/by-nc/4.0/"" target=""_blank"" rel=""noreferrer noopener"">https://creativecommons.org/licenses/by-nc/4.0/</a>",,PDF,,,dejarnette-hm-and-eh-tract-57,"Tract 57",,,,,,,,,,,,,,,,,,,,,,,,,,,,,,,,,,,,,,,,,,Dejarnett,https://omeka.lib.jmu.edu/erp/files/original/b615c12d6e956a0658a5660dd3f996a6.pdf,Text,"Rappahannock County SNP Records: Court Proceedings",1,0
8298,https://omeka.lib.jmu.edu/erp/items/show/8298,,,,,,,,,,,,,,,,,,,,,,,,,,,,,,,,,,,,,,,,,"Deposition ",,"Tract 140.  Deposition by S.R. Aleshire",,"Madison County Circuit Courthouse","JMU Libraries",,,"<a href=""http://creativecommons.org/licenses/by-nc/4.0/""></a><br />This work is licensed under a <a href=""http://creativecommons.org/licenses/by-nc/4.0/"">Creative Commons Attribution-NonCommercial 4.0 International License</a>.",,PDF,,,MCSNP_deposition-tract-140,"Tract 140",,,,,,,,,,,,,,,,,,,,,,,,,,,,,,,,,,,,,,,,,,Aleshire,https://omeka.lib.jmu.edu/erp/files/original/Madison_County_SNP_Records_Miscellaneous_Documents/mcsnp_deposition-tract-140.pdf,Text,"Madison County SNP Records: Miscellaneous Documents",1,0
8299,https://omeka.lib.jmu.edu/erp/items/show/8299,,,,,,,,,,,,,,,,,,,,,,,,,,,,,,,,,,,,,,,,,Deposition,,"Tract 59 and 59a. Deposition by Necie Dodson and others ",,"Madison County Circuit Courthouse","JMU Libraries",,,"<a href=""http://creativecommons.org/licenses/by-nc/4.0/""></a><br />This work is licensed under a <a href=""http://creativecommons.org/licenses/by-nc/4.0/"">Creative Commons Attribution-NonCommercial 4.0 International License</a>.",,PDF,,,MCSNP_deposition-tract-59-59-a,"Tract 59 59a",,,,,,,,,,,,,,,,,,,,,,,,,,,,,,,,,,,,,,,,,,Dodson,https://omeka.lib.jmu.edu/erp/files/original/Madison_County_SNP_Records_Miscellaneous_Documents/mcsnp_deposition-tract-59-59-a.pdf,Text,"Madison County SNP Records: Miscellaneous Documents",1,0
8300,https://omeka.lib.jmu.edu/erp/items/show/8300,,,,,,,,,,,,,,,,,,,,,,,,,,,,,,,,,,,,,,,,,Deposition,,"R.D. Koontz Deposition",,"Madison County Circuit Courthouse","JMU Libraries",,,"<a href=""http://creativecommons.org/licenses/by-nc/4.0/""></a><br />This work is licensed under a <a href=""http://creativecommons.org/licenses/by-nc/4.0/"">Creative Commons Attribution-NonCommercial 4.0 International License</a>.",,PDF,,,MCSNP_deposition-no-tract,"No Tract",,,,,,,,,,,,,,,,,,,,,,,,,,,,,,,,,,,,,,,,,,Koontz,https://omeka.lib.jmu.edu/erp/files/original/Madison_County_SNP_Records_Miscellaneous_Documents/mcsnp_deposition-no-tract.pdf,Text,"Madison County SNP Records: Miscellaneous Documents",1,0
8301,https://omeka.lib.jmu.edu/erp/items/show/8301,,,,,,,,,,,,,,,,,,,,,,,,,,,,,,,,,,,,,,,,,Deposition,,"Tract 144.  Deposition by Frances E. Lamb",,"Madison County Circuit Courthouse","JMU Libraries",,,"<a href=""http://creativecommons.org/licenses/by-nc/4.0/""></a><br />This work is licensed under a <a href=""http://creativecommons.org/licenses/by-nc/4.0/"">Creative Commons Attribution-NonCommercial 4.0 International License</a>.",,PDF,,,MCSNP_deposition-tract-144,"Tract 144",,,,,,,,,,,,,,,,,,,,,,,,,,,,,,,,,,,,,,,,,,Lamb,https://omeka.lib.jmu.edu/erp/files/original/Madison_County_SNP_Records_Miscellaneous_Documents/mcsnp_deposition-tract-144.pdf,Text,"Madison County SNP Records: Miscellaneous Documents",1,0
8302,https://omeka.lib.jmu.edu/erp/items/show/8302,,,,,,,,,,,,,,,,,,,,,,,,,,,,,,,,,,,,,,,,,Deposition,,"Tract 141. Deposition by Isaac N. Long, Sr",,"Madison County Circuit Courthouse","JMU Libraries",,,"<a href=""http://creativecommons.org/licenses/by-nc/4.0/""></a><br />This work is licensed under a <a href=""http://creativecommons.org/licenses/by-nc/4.0/"">Creative Commons Attribution-NonCommercial 4.0 International License</a>.",,PDF,,,MCSNP_deposition-tract-141,"Tract 141",,,,,,,,,,,,,,,,,,,,,,,,,,,,,,,,,,,,,,,,,,Long,https://omeka.lib.jmu.edu/erp/files/original/Madison_County_SNP_Records_Miscellaneous_Documents/mcsnp_deposition-tract-141.pdf,Text,"Madison County SNP Records: Miscellaneous Documents",1,0
8303,https://omeka.lib.jmu.edu/erp/items/show/8303,,,,,,,,,,,,,,,,,,,,,,,,,,,,,,,,,,,,,,,,,Deposition,,"Tract 134.  Deposition by B.H. Spitler",,"Madison County Circuit Courthouse","JMU Libraries",,,"<a href=""http://creativecommons.org/licenses/by-nc/4.0/""></a><br />This work is licensed under a <a href=""http://creativecommons.org/licenses/by-nc/4.0/"">Creative Commons Attribution-NonCommercial 4.0 International License</a>.",,PDF,,,MCSNP_deposition-tract-134,"Tract 134",,,,,,,,,,,,,,,,,,,,,,,,,,,,,,,,,,,,,,,,,,Spitler,https://omeka.lib.jmu.edu/erp/files/original/Madison_County_SNP_Records_Miscellaneous_Documents/mcsnp_deposition-tract-134.pdf,Text,"Madison County SNP Records: Miscellaneous Documents",1,0
1126,https://omeka.lib.jmu.edu/erp/items/show/1126,,,,,,,,,,,,,,,,,,,,,,,,,,,,,,,,,,,,,,,,,"Designation of William E. Carson",,,,"MISC - Mar. 28, 1930 - Nov. 20, 1931","Rockingham County Circuit Courthouse",,"Pake Davis, Tristan Nelson, Liana Bayne","This work has been identified as being free of known restrictions under copyright law, including all related and neighboring rights.(<a href=""https://creativecommons.org/publicdomain/mark/1.0/"" target=""_blank"" rel=""noreferrer"">https://creativecommons.org/publicdomain/mark/1.0/</a>)",,PDF,,,designation-of-william-e-carson.pdf,,,,,,,,,,,,,,,,,,,,,,,,,,,,,,,,,,,,,,,,,,,,https://omeka.lib.jmu.edu/erp/files/original/12bc6f4123ba48f9dd6aeef1eb626c90.pdf,Text,"Rockingham County SNP Records: Miscellaneous Documents",1,0
700,https://omeka.lib.jmu.edu/erp/items/show/700,,,,,,,,,,,,,,,,,,,,,,,,,,,,,,,,,,,,,,,,,"Diehl, Clark",,"Location: Spur Ridge",,"Dean, S.A.- Fogle, Earl C.","Rockingham County Circuit Courthouse",,"Pake Davis, Tristan Nelson, Liana Bayne","This work has been identified as being free of known restrictions under copyright law, including all related and neighboring rights.&nbsp;(<a href=""https://creativecommons.org/publicdomain/mark/1.0/"" target=""_blank"" rel=""noreferrer"">https://creativecommons.org/publicdomain/mark/1.0/</a>)",,PDF,,,diehl-clark.pdf,"Tract(s): 146",,,,,,,,,,,,,,,,,,,,,,,,,,,,,,,,,,,,,,,,,,Diehl,https://omeka.lib.jmu.edu/erp/files/original/ef51338064de021e4327c2a9aca0d181.pdf,Text,"Rockingham County SNP Records: Court Proceedings",1,0
6215,https://omeka.lib.jmu.edu/erp/items/show/6215,,,,,,,,,,,,,,,,,,,,,,,,,,,,,,,,,,,,,,,,,"Dodson WB",,"<p><strong>Tract: </strong>201; </p><p><strong>Location: </strong>Head of Hazel River on Beech Spring Road; </p><p><strong>Cost/Acre: </strong>$3.27; </p><p><strong>Estimate Value: </strong>$98.00; </p><p><strong>Number of Acres: </strong>30.0; </p><p><strong>Monies Awarded: </strong>$170.50</p>",,"Rappahannock County Circuit Courthouse","JMU Libraries",,,"<a href=""https://creativecommons.org/licenses/by-nc/4.0/"" target=""_blank"" rel=""noreferrer noopener"">https://creativecommons.org/licenses/by-nc/4.0/</a>",,PDF,,,dodson-wb-tract-201,"Tract 201",,,,,,,,,,,,,,,,,,,,,,,,,,,,,,,,,,,,,,,,,,Dodson,https://omeka.lib.jmu.edu/erp/files/original/d96475c89a3d55cb4f93ddb7072ac019.pdf,Text,"Rappahannock County SNP Records: Court Proceedings",1,0
6214,https://omeka.lib.jmu.edu/erp/items/show/6214,,,,,,,,,,,,,,,,,,,,,,,,,,,,,,,,,,,,,,,,,"Dodson, Alice",,"<p><strong>Tract: </strong>163; </p><p><strong>Location: </strong>Beech Spring Hollow; </p><p><strong>Cost/Acre: </strong>$5.13; </p><p><strong>Estimate Value: </strong>$458.00; </p><p><strong>Number of Acres: </strong>89.0; </p><p><strong>Monies Awarded: </strong>$458.00</p>",,"Rappahannock County Circuit Courthouse","JMU Libraries",,,"<a href=""https://creativecommons.org/licenses/by-nc/4.0/"" target=""_blank"" rel=""noreferrer noopener"">https://creativecommons.org/licenses/by-nc/4.0/</a>",,PDF,,,dodson-alice-tract-163,"Tract 163",,,,,,,,,,,,,,,,,,,,,,,,,,,,,,,,,,,,,,,,,,Dodson,https://omeka.lib.jmu.edu/erp/files/original/ab93b2232ea59d8cfec43d3d1f9d3d5a.pdf,Text,"Rappahannock County SNP Records: Court Proceedings",1,0
6212,https://omeka.lib.jmu.edu/erp/items/show/6212,,,,,,,,,,,,,,,,,,,,,,,,,,,,,,,,,,,,,,,,,"Dodson, Booten",,"<p><strong>Tract: </strong>203; </p><p><strong>Location: </strong>1/2 mile below Panorama; </p><p><strong>Cost/Acre: </strong>$13.24; </p><p><strong>Estimate Value: </strong>$1,841.00; </p><p><strong>Number of Acres: </strong>140.0; </p><p><strong>Monies Awarded: </strong>$1,841.00</p>",,"Rappahannock County Circuit Courthouse","JMU Libraries",,,"<a href=""https://creativecommons.org/licenses/by-nc/4.0/"" target=""_blank"" rel=""noreferrer noopener"">https://creativecommons.org/licenses/by-nc/4.0/</a>",,PDF,,,dodson-booten-tract-203,"Tract 203",,,,,,,,,,,,,,,,,,,,,,,,,,,,,,,,,,,,,,,,,,"Atkins,Dodson",https://omeka.lib.jmu.edu/erp/files/original/a36705401fdf2036937b6184a4d70f4e.pdf,Text,"Rappahannock County SNP Records: Court Proceedings",1,0
