﻿"Item Id","Item URI","Dublin Core:Alternative Title","Dublin Core:Abstract","Dublin Core:Table Of Contents","Dublin Core:Date Available","Dublin Core:Date Created","Dublin Core:Date Accepted","Dublin Core:Date Copyrighted","Dublin Core:Date Submitted","Dublin Core:Date Issued","Dublin Core:Date Modified","Dublin Core:Date Valid","Dublin Core:Access Rights","Dublin Core:License","Dublin Core:Conforms To","Dublin Core:Has Format","Dublin Core:Has Part","Dublin Core:Has Version","Dublin Core:Is Format Of","Dublin Core:Is Part Of","Dublin Core:Is Referenced By","Dublin Core:Is Replaced By","Dublin Core:Is Required By","Dublin Core:Is Version Of","Dublin Core:References","Dublin Core:Replaces","Dublin Core:Requires","Dublin Core:Extent","Dublin Core:Medium","Dublin Core:Bibliographic Citation","Dublin Core:Spatial Coverage","Dublin Core:Temporal Coverage","Dublin Core:Accrual Method","Dublin Core:Accrual Periodicity","Dublin Core:Accrual Policy","Dublin Core:Audience","Dublin Core:Audience Education Level","Dublin Core:Mediator","Dublin Core:Instructional Method","Dublin Core:Provenance","Dublin Core:Rights Holder","Dublin Core:Title","Dublin Core:Subject","Dublin Core:Description","Dublin Core:Creator","Dublin Core:Source","Dublin Core:Publisher","Dublin Core:Date","Dublin Core:Contributor","Dublin Core:Rights","Dublin Core:Relation","Dublin Core:Format","Dublin Core:Language","Dublin Core:Type","Dublin Core:Identifier","Dublin Core:Coverage","Item Type Metadata:Text","Item Type Metadata:Interviewer","Item Type Metadata:Interviewee","Item Type Metadata:Location","Item Type Metadata:Transcription","Item Type Metadata:Local URL","Item Type Metadata:Original Format","Item Type Metadata:Physical Dimensions","Item Type Metadata:Duration","Item Type Metadata:Compression","Item Type Metadata:Producer","Item Type Metadata:Director","Item Type Metadata:Bit Rate/Frequency","Item Type Metadata:Time Summary","Item Type Metadata:Email Body","Item Type Metadata:Subject Line","Item Type Metadata:From","Item Type Metadata:To","Item Type Metadata:CC","Item Type Metadata:BCC","Item Type Metadata:Number of Attachments","Item Type Metadata:Standards","Item Type Metadata:Objectives","Item Type Metadata:Materials","Item Type Metadata:Lesson Plan Text","Item Type Metadata:URL","Item Type Metadata:Event Type","Item Type Metadata:Participants","Item Type Metadata:Birth Date","Item Type Metadata:Birthplace","Item Type Metadata:Death Date","Item Type Metadata:Occupation","Item Type Metadata:Biographical Text","Item Type Metadata:Bibliography","Item Type Metadata:Player","Item Type Metadata:Episode","Item Type Metadata:Season","Item Type Metadata:Episode Type","Item Type Metadata:Explicit","Item Type Metadata:Block","PDF Text:Text",tags,file,itemType,collection,public,featured
3366,https://omeka.lib.jmu.edu/erp/items/show/3366,,,,,,,,,,,,,,,,,,,,,,,,,,,,,,,,,,,,,,,,,"Commonwealth v. Russell Turner","Misdemeanor^^guilty^^operated an automobile under the influence","Misdemeanor; Guilty",,"Rockingham County Circuit Court ","JMU Libraries",1932,"Craig Schaefer, Kayla Heslin, Selena St. Andre","This work has been identified as being free of known restrictions under copyright law, including all related and neighboring rights. (<a href=""https://creativecommons.org/publicdomain/mark/1.0/"" target=""_blank"" rel=""noreferrer noopener"">https://creativecommons.org/publicdomain/mark/1.0/</a>)",,"PDF ",,,RcPr-box10-020,,,,,,,,,,,,,,,,,,,,,,,,,,,,,,,,,,,,,,,,,,,Turner,https://omeka.lib.jmu.edu/erp/files/original/60854a9adddec493f73d94d5165e7688.pdf,Text,"Rockingham County Prohibition Records: Criminal Cases",1,0
3111,https://omeka.lib.jmu.edu/erp/items/show/3111,,,,,,,,,,,,,,,,,,,,,,,,,,,,,,,,,,,,,,,,,"Commonwealth v. Russell Smith",Misdemeanor^^Indictment^^posession,"Misdemeanor; Indictment",,"Rockingham County Circuit Court ","JMU Libraries",1927,"Craig Schaefer, Kayla Heslin, Selena St. Andre","This work has been identified as being free of known restrictions under copyright law, including all related and neighboring rights. (<a href=""https://creativecommons.org/publicdomain/mark/1.0/"" target=""_blank"" rel=""noreferrer noopener"">https://creativecommons.org/publicdomain/mark/1.0/</a>)",,"PDF ",,,RcPr-box7-002,,,,,,,,,,,,,,,,,,,,,,,,,,,,,,,,,,,,,,,,,,,Smith,https://omeka.lib.jmu.edu/erp/files/original/699ff528abc21b770a691914314c21dd.pdf,Text,"Rockingham County Prohibition Records: Criminal Cases",1,0
8357,https://omeka.lib.jmu.edu/erp/items/show/8357,,,,,,,,,,,,,,,,,,,,,,,,,,,,,,,,,,,,,,,,,"Commonwealth v. Russell Eppard and Charles Slye",Felony^^Murder,"Defendant charged with felony murder.",,,"JMU Libraries",1931,,"This work has been identified as being free of known restrictions under copyright law, including all related and neighboring rights.<br /><a href=""https://creativecommons.org/publicdomain/mark/1.0/"" target=""_blank"" rel=""noreferrer noopener"">https://creativecommons.org/publicdomain/mark/1.0/</a>",,PDF,,,CCR001_011_001,,,,,,,,,,,,,,,,,,,,,,,,,,,,,,,,,,,,,,,,,,,"Davis,Eppard,Slye",https://omeka.lib.jmu.edu/erp/files/original/Rockingham_County_Criminal_Court_Criminal_Cases/ccr001_011_001-commonwealth-v-russell-eppard-charles-slye.pdf,Text,"Rockingham County Criminal Court: Criminal Cases",1,0
3225,https://omeka.lib.jmu.edu/erp/items/show/3225,,,,,,,,,,,,,,,,,,,,,,,,,,,,,,,,,,,,,,,,,"Commonwealth v. Russell Davis","Misdemeanor^^Indictment^^posession ardent spirits","Misdemeanor; Indictment",,"Rockingham County Circuit Court ","JMU Libraries",1930,"Craig Schaefer, Kayla Heslin, Selena St. Andre","This work has been identified as being free of known restrictions under copyright law, including all related and neighboring rights. (<a href=""https://creativecommons.org/publicdomain/mark/1.0/"" target=""_blank"" rel=""noreferrer noopener"">https://creativecommons.org/publicdomain/mark/1.0/</a>)",,PDF,,,RcPr-box8-033,,,,,,,,,,,,,,,,,,,,,,,,,,,,,,,,,,,,,,,,,,,Davis,https://omeka.lib.jmu.edu/erp/files/original/0f4d97a4c6556c40f1f2fa2e7fdf3a38.pdf,Text,"Rockingham County Prohibition Records: Criminal Cases",1,0
6469,https://omeka.lib.jmu.edu/erp/items/show/6469,,,,,,,,,,,,,,,,,,,,,,,,,,,,,,,,,,,,,,,,,"Commonwealth v. Rudolph White","Felony^^Attempted Murder","Defendant charged with felony attempted murder.","Rockingham County Criminal Court",,"JMU Libraries",1902,"Jennifer Taylor","This work has been identified as being free of known restrictions under copyright law, including all related and neighboring rights.<br /><a href=""https://creativecommons.org/publicdomain/mark/1.0/"" target=""_blank"" rel=""noreferrer noopener"">https://creativecommons.org/publicdomain/mark/1.0/</a>",,PDF,,,CCR001_003_039,,,,,,,,,,,,,,,,,,,,,,,,,,,,,,,,,,,,,,,,,,,"Burtner,White",https://omeka.lib.jmu.edu/erp/files/original/Rockingham_County_Criminal_Court_Criminal_Cases/ccr001_003_039-commonwealth-v-rudolph-white.pdf,Text,"Rockingham County Criminal Court: Criminal Cases",1,1
3288,https://omeka.lib.jmu.edu/erp/items/show/3288,,,,,,,,,,,,,,,,,,,,,,,,,,,,,,,,,,,,,,,,,"Commonwealth v. Roy Zirkle","Misdemeanor^^Indictment^^operated an automobile under the influence^^30 days in jail & $100 fine","Misdemeanor; Indictment",,"Rockingham County Circuit Court ","JMU Libraries",1930,"Craig Schaefer, Kayla Heslin, Selena St. Andre","This work has been identified as being free of known restrictions under copyright law, including all related and neighboring rights. (<a href=""https://creativecommons.org/publicdomain/mark/1.0/"" target=""_blank"" rel=""noreferrer noopener"">https://creativecommons.org/publicdomain/mark/1.0/</a>)",,"PDF ",,,RcPr-box9-014,,,,,,,,,,,,,,,,,,,,,,,,,,,,,,,,,,,,,,,,,,,Zirkle,https://omeka.lib.jmu.edu/erp/files/original/b814f9983751a377759468ce03307680.pdf,Text,"Rockingham County Prohibition Records: Criminal Cases",1,0
3207,https://omeka.lib.jmu.edu/erp/items/show/3207,,,,,,,,,,,,,,,,,,,,,,,,,,,,,,,,,,,,,,,,,"Commonwealth v. Roy Turner","Misdemeanor^^Indictment^^operated an automobile under the influence","Misdemeanor; Indictment",,"Rockingham County Circuit Court ","JMU Libraries",1929,"Craig Schaefer, Kayla Heslin, Selena St. Andre","This work has been identified as being free of known restrictions under copyright law, including all related and neighboring rights. (<a href=""https://creativecommons.org/publicdomain/mark/1.0/"" target=""_blank"" rel=""noreferrer noopener"">https://creativecommons.org/publicdomain/mark/1.0/</a>)",,PDF,,,RcPr-box8-015,,,,,,,,,,,,,,,,,,,,,,,,,,,,,,,,,,,,,,,,,,,Turner,https://omeka.lib.jmu.edu/erp/files/original/81df1a690f043b9758a75eb747eb7ca1.pdf,Text,"Rockingham County Prohibition Records: Criminal Cases",1,0
6470,https://omeka.lib.jmu.edu/erp/items/show/6470,,,,,,,,,,,,,,,,,,,,,,,,,,,,,,,,,,,,,,,,,"Commonwealth v. Roy Orbaugh",Felony^^Rape,"Defendant charged with felony rape.","Rockingham County Criminal Court",,"JMU Libraries",1908,"Jennifer Taylor","This work has been identified as being free of known restrictions under copyright law, including all related and neighboring rights.<br /><a href=""https://creativecommons.org/publicdomain/mark/1.0/"" target=""_blank"" rel=""noreferrer noopener"">https://creativecommons.org/publicdomain/mark/1.0/</a>",,PDF,,,CCR001_005_124,,,,,,,,,,,,,,,,,,,,,,,,,,,,,,,,,,,,,,,,,,,"May,Orbaugh",https://omeka.lib.jmu.edu/erp/files/original/Rockingham_County_Criminal_Court_Criminal_Cases/ccr001_005_124-commonwealth-v-roy-orbaugh.pdf,Text,"Rockingham County Criminal Court: Criminal Cases",1,1
2746,https://omeka.lib.jmu.edu/erp/items/show/2746,,,,,,,,,,,,,,,,,,,,,,,,,,,,,,,,,,,,,,,,,"Commonwealth v. Roy L. Fridley","warrant case^^guilty^^operate automobile under the influence","Warrant Case; Guilty",,"Rockingham County Circuit Court ","JMU Libraries",1916,"Craig Schaefer, Kayla Heslin, Selena St. Andre","This work has been identified as being free of known restrictions under copyright law, including all related and neighboring rights. (<a href=""https://creativecommons.org/publicdomain/mark/1.0/"" target=""_blank"" rel=""noreferrer noopener"">https://creativecommons.org/publicdomain/mark/1.0/</a>)",,"PDF ",,,RcPr-box1-007,,,,,,,,,,,,,,,,,,,,,,,,,,,,,,,,,,,,,,,,,,,Fridley,https://omeka.lib.jmu.edu/erp/files/original/c24de3be98c20770ab45206f64b01a74.pdf,Text,"Rockingham County Prohibition Records: Criminal Cases",1,0
6471,https://omeka.lib.jmu.edu/erp/items/show/6471,,,,,,,,,,,,,,,,,,,,,,,,,,,,,,,,,,,,,,,,,"Commonwealth v. Roy Fridley",Felony^^Murder,"Defendant charged with felony murder.","Rockingham County Criminal Court",,"JMU Libraries",1925,"Jennifer Taylor","This work has been identified as being free of known restrictions under copyright law, including all related and neighboring rights.<br /><a href=""https://creativecommons.org/publicdomain/mark/1.0/"" target=""_blank"" rel=""noreferrer noopener"">https://creativecommons.org/publicdomain/mark/1.0/</a>",,PDF,,,CCR001_009_274,,,,,,,,,,,,,,,,,,,,,,,,,,,,,,,,,,,,,,,,,,,"Fridley,Weaver",https://omeka.lib.jmu.edu/erp/files/original/Rockingham_County_Criminal_Court_Criminal_Cases/ccr001_009_274-commonwealth-v-roy-fridley.pdf,Text,"Rockingham County Criminal Court: Criminal Cases",1,1
3275,https://omeka.lib.jmu.edu/erp/items/show/3275,,,,,,,,,,,,,,,,,,,,,,,,,,,,,,,,,,,,,,,,,"Commonwealth v. Rosie Sites","Misdemeanor^^Indictment^^posession of ardent spirits","Misdemeanor; Indictment",,"Rockingham County Circuit Court ","JMU Libraries",1930,"Craig Schaefer, Kayla Heslin, Selena St. Andre","This work has been identified as being free of known restrictions under copyright law, including all related and neighboring rights. (<a href=""https://creativecommons.org/publicdomain/mark/1.0/"" target=""_blank"" rel=""noreferrer noopener"">https://creativecommons.org/publicdomain/mark/1.0/</a>)",,"PDF ",,,RcPr-box9-001,,,,,,,,,,,,,,,,,,,,,,,,,,,,,,,,,,,,,,,,,,,Sites,https://omeka.lib.jmu.edu/erp/files/original/87fa09d15034b76ecc7f3971282c33c9.pdf,Text,"Rockingham County Prohibition Records: Criminal Cases",1,0
3231,https://omeka.lib.jmu.edu/erp/items/show/3231,,,,,,,,,,,,,,,,,,,,,,,,,,,,,,,,,,,,,,,,,"Commonwealth v. Rosie Dean",Misdemeanor^^Indictment^^posession^^bottles,"Misdemeanor; Indictment",,"Rockingham County Circuit Court ","JMU Libraries",1930,"Craig Schaefer, Kayla Heslin, Selena St. Andre","This work has been identified as being free of known restrictions under copyright law, including all related and neighboring rights. (<a href=""https://creativecommons.org/publicdomain/mark/1.0/"" target=""_blank"" rel=""noreferrer noopener"">https://creativecommons.org/publicdomain/mark/1.0/</a>)",,PDF,,,RcPr-box8-039,,,,,,,,,,,,,,,,,,,,,,,,,,,,,,,,,,,,,,,,,,,Dean,https://omeka.lib.jmu.edu/erp/files/original/061e7995c27de51d038f1941bc4e6a8b.pdf,Text,"Rockingham County Prohibition Records: Criminal Cases",1,0
3230,https://omeka.lib.jmu.edu/erp/items/show/3230,,,,,,,,,,,,,,,,,,,,,,,,,,,,,,,,,,,,,,,,,"Commonwealth v. Rose Dean","Felony^^Indictment^^posession^^apply for release from imprisonment","Felony; Indictment",,"Rockingham County Circuit Court ","JMU Libraries",1930,"Craig Schaefer, Kayla Heslin, Selena St. Andre","This work has been identified as being free of known restrictions under copyright law, including all related and neighboring rights. (<a href=""https://creativecommons.org/publicdomain/mark/1.0/"" target=""_blank"" rel=""noreferrer noopener"">https://creativecommons.org/publicdomain/mark/1.0/</a>)",,PDF,,,RcPr-box8-038,,,,,,,,,,,,,,,,,,,,,,,,,,,,,,,,,,,,,,,,,,,Dean,https://omeka.lib.jmu.edu/erp/files/original/6b81f3dc0c9ddcaaa1e1b13f03b1d673.pdf,Text,"Rockingham County Prohibition Records: Criminal Cases",1,0
3267,https://omeka.lib.jmu.edu/erp/items/show/3267,,,,,,,,,,,,,,,,,,,,,,,,,,,,,,,,,,,,,,,,,"Commonwealth v. Roscoe Rexrode","Misdemeanor^^guilty^^operated an automobile under the influence^^30 days in jail & $100 fine","Misdemeanor; Guilty",,"Rockingham County Circuit Court ","JMU Libraries",1930,"Craig Schaefer, Kayla Heslin, Selena St. Andre","This work has been identified as being free of known restrictions under copyright law, including all related and neighboring rights. (<a href=""https://creativecommons.org/publicdomain/mark/1.0/"" target=""_blank"" rel=""noreferrer noopener"">https://creativecommons.org/publicdomain/mark/1.0/</a>)",,PDF,,,RcPr-box8-075,,,,,,,,,,,,,,,,,,,,,,,,,,,,,,,,,,,,,,,,,,,Rexrode,https://omeka.lib.jmu.edu/erp/files/original/e36605484ff1bea03eb31d54d41c7db1.pdf,Text,"Rockingham County Prohibition Records: Criminal Cases",1,0
3174,https://omeka.lib.jmu.edu/erp/items/show/3174,,,,,,,,,,,,,,,,,,,,,,,,,,,,,,,,,,,,,,,,,"Commonwealth v. Roosevelt Brown","Misdemeanor^^not guilty^^operated an automobile under the influence","Misdemeanor; Not Guilty",,"Rockingham County Circuit Court ","JMU Libraries",1929,"Craig Schaefer, Kayla Heslin, Selena St. Andre","This work has been identified as being free of known restrictions under copyright law, including all related and neighboring rights. (<a href=""https://creativecommons.org/publicdomain/mark/1.0/"" target=""_blank"" rel=""noreferrer noopener"">https://creativecommons.org/publicdomain/mark/1.0/</a>)",,"PDF ",,,RcPr-box7-065,,,,,,,,,,,,,,,,,,,,,,,,,,,,,,,,,,,,,,,,,,,Brown,https://omeka.lib.jmu.edu/erp/files/original/f9e77ee5b8b84c28c6cbad629c3e2ccf.pdf,Text,"Rockingham County Prohibition Records: Criminal Cases",1,0
2995,https://omeka.lib.jmu.edu/erp/items/show/2995,,,,,,,,,,,,,,,,,,,,,,,,,,,,,,,,,,,,,,,,,"Commonwealth v. Robert Williams",Misdemeanor^^Indictment,"Misdemeanor; Indictment",,"Rockingham County Circuit Court ","JMU Libraries",1924,"Craig Schaefer, Kayla Heslin, Selena St. Andre","This work has been identified as being free of known restrictions under copyright law, including all related and neighboring rights. (<a href=""https://creativecommons.org/publicdomain/mark/1.0/"" target=""_blank"" rel=""noreferrer noopener"">https://creativecommons.org/publicdomain/mark/1.0/</a>)",,PDF,,,RcPr-box4-056,,,,,,,,,,,,,,,,,,,,,,,,,,,,,,,,,,,,,,,,,,,Williams,https://omeka.lib.jmu.edu/erp/files/original/0e947262fd6cb2fb8451550e1681c726.pdf,Text,"Rockingham County Prohibition Records: Criminal Cases",1,0
6472,https://omeka.lib.jmu.edu/erp/items/show/6472,,,,,,,,,,,,,,,,,,,,,,,,,,,,,,,,,,,,,,,,,"Commonwealth v. Robert Webster",Felony^^Assault,"Defendant charged with felony assault.","Rockingham County Criminal Court",,"JMU Libraries",1901,"Jennifer Taylor","This work has been identified as being free of known restrictions under copyright law, including all related and neighboring rights.<br /><a href=""https://creativecommons.org/publicdomain/mark/1.0/"" target=""_blank"" rel=""noreferrer noopener"">https://creativecommons.org/publicdomain/mark/1.0/</a>",,PDF,,,CCR001_003_030,,,,,,,,,,,,,,,,,,,,,,,,,,,,,,,,,,,,,,,,,,,"Stuart,Webster",https://omeka.lib.jmu.edu/erp/files/original/Rockingham_County_Criminal_Court_Criminal_Cases/ccr001_003_030-commonwealth-v-robert-webster.pdf,Text,"Rockingham County Criminal Court: Criminal Cases",1,1
3168,https://omeka.lib.jmu.edu/erp/items/show/3168,,,,,,,,,,,,,,,,,,,,,,,,,,,,,,,,,,,,,,,,,"Commonwealth v. Robert Smith",Misdemeanor^^Indictment^^posession,"Misdemeanor; Indictment",,"Rockingham County Circuit Court ","JMU Libraries",1928,"Craig Schaefer, Kayla Heslin, Selena St. Andre","This work has been identified as being free of known restrictions under copyright law, including all related and neighboring rights. (<a href=""https://creativecommons.org/publicdomain/mark/1.0/"" target=""_blank"" rel=""noreferrer noopener"">https://creativecommons.org/publicdomain/mark/1.0/</a>)",,"PDF ",,,RcPr-box7-059,,,,,,,,,,,,,,,,,,,,,,,,,,,,,,,,,,,,,,,,,,,Smith,https://omeka.lib.jmu.edu/erp/files/original/c273ba7f9f007f13d72792a629357ccd.pdf,Text,"Rockingham County Prohibition Records: Criminal Cases",1,0
3065,https://omeka.lib.jmu.edu/erp/items/show/3065,,,,,,,,,,,,,,,,,,,,,,,,,,,,,,,,,,,,,,,,,"Commonwealth v. Robert Sipe",Felony^^guilty^^indictment,"Felony; Guilty",,"Rockingham County Circuit Court ","JMU Libraries",1926,"Craig Schaefer, Kayla Heslin, Selena St. Andre","This work has been identified as being free of known restrictions under copyright law, including all related and neighboring rights. (<a href=""https://creativecommons.org/publicdomain/mark/1.0/"" target=""_blank"" rel=""noreferrer noopener"">https://creativecommons.org/publicdomain/mark/1.0/</a>)",,"PDF ",,,RcPr-box6-011,,,,,,,,,,,,,,,,,,,,,,,,,,,,,,,,,,,,,,,,,,,Sipe,https://omeka.lib.jmu.edu/erp/files/original/bf62e9ff23de96ed44236c9eeae7ab52.pdf,Text,"Rockingham County Prohibition Records: Criminal Cases",1,0
2989,https://omeka.lib.jmu.edu/erp/items/show/2989,,,,,,,,,,,,,,,,,,,,,,,,,,,,,,,,,,,,,,,,,"Commonwealth v. Robert Sipe","MIsdemeanor^^Indictment^^posession of still^^Still","Misdemeanor; Indictment",,"Rockingham County Circuit Court ","JMU Libraries",1924,"Craig Schaefer, Kayla Heslin, Selena St. Andre","This work has been identified as being free of known restrictions under copyright law, including all related and neighboring rights. (<a href=""https://creativecommons.org/publicdomain/mark/1.0/"" target=""_blank"" rel=""noreferrer noopener"">https://creativecommons.org/publicdomain/mark/1.0/</a>)",,PDF,,,RcPr-box4-050,,,,,,,,,,,,,,,,,,,,,,,,,,,,,,,,,,,,,,,,,,,Sipe,https://omeka.lib.jmu.edu/erp/files/original/b3dfa63b0adc30768c1160e5590315b0.pdf,Text,"Rockingham County Prohibition Records: Criminal Cases",1,0
