﻿"Item Id","Item URI","Dublin Core:Alternative Title","Dublin Core:Abstract","Dublin Core:Table Of Contents","Dublin Core:Date Available","Dublin Core:Date Created","Dublin Core:Date Accepted","Dublin Core:Date Copyrighted","Dublin Core:Date Submitted","Dublin Core:Date Issued","Dublin Core:Date Modified","Dublin Core:Date Valid","Dublin Core:Access Rights","Dublin Core:License","Dublin Core:Conforms To","Dublin Core:Has Format","Dublin Core:Has Part","Dublin Core:Has Version","Dublin Core:Is Format Of","Dublin Core:Is Part Of","Dublin Core:Is Referenced By","Dublin Core:Is Replaced By","Dublin Core:Is Required By","Dublin Core:Is Version Of","Dublin Core:References","Dublin Core:Replaces","Dublin Core:Requires","Dublin Core:Extent","Dublin Core:Medium","Dublin Core:Bibliographic Citation","Dublin Core:Spatial Coverage","Dublin Core:Temporal Coverage","Dublin Core:Accrual Method","Dublin Core:Accrual Periodicity","Dublin Core:Accrual Policy","Dublin Core:Audience","Dublin Core:Audience Education Level","Dublin Core:Mediator","Dublin Core:Instructional Method","Dublin Core:Provenance","Dublin Core:Rights Holder","Dublin Core:Title","Dublin Core:Subject","Dublin Core:Description","Dublin Core:Creator","Dublin Core:Source","Dublin Core:Publisher","Dublin Core:Date","Dublin Core:Contributor","Dublin Core:Rights","Dublin Core:Relation","Dublin Core:Format","Dublin Core:Language","Dublin Core:Type","Dublin Core:Identifier","Dublin Core:Coverage","Item Type Metadata:Text","Item Type Metadata:Interviewer","Item Type Metadata:Interviewee","Item Type Metadata:Location","Item Type Metadata:Transcription","Item Type Metadata:Local URL","Item Type Metadata:Original Format","Item Type Metadata:Physical Dimensions","Item Type Metadata:Duration","Item Type Metadata:Compression","Item Type Metadata:Producer","Item Type Metadata:Director","Item Type Metadata:Bit Rate/Frequency","Item Type Metadata:Time Summary","Item Type Metadata:Email Body","Item Type Metadata:Subject Line","Item Type Metadata:From","Item Type Metadata:To","Item Type Metadata:CC","Item Type Metadata:BCC","Item Type Metadata:Number of Attachments","Item Type Metadata:Standards","Item Type Metadata:Objectives","Item Type Metadata:Materials","Item Type Metadata:Lesson Plan Text","Item Type Metadata:URL","Item Type Metadata:Event Type","Item Type Metadata:Participants","Item Type Metadata:Birth Date","Item Type Metadata:Birthplace","Item Type Metadata:Death Date","Item Type Metadata:Occupation","Item Type Metadata:Biographical Text","Item Type Metadata:Bibliography","Item Type Metadata:Player","Item Type Metadata:Episode","Item Type Metadata:Season","Item Type Metadata:Episode Type","Item Type Metadata:Explicit","Item Type Metadata:Block","PDF Text:Text",tags,file,itemType,collection,public,featured
6444,https://omeka.lib.jmu.edu/erp/items/show/6444,,,,,,,,,,,,,,,,,,,,,,,,,,,,,,,,,,,,,,,,,"Commonwealth v. Wade Green",Felony^^Perjury,"Defendant charged with felony perjury.","Rockingham County Criminal Court",,"JMU Libraries",1909,"Jennifer Taylor","This work has been identified as being free of known restrictions under copyright law, including all related and neighboring rights.<br /><a href=""https://creativecommons.org/publicdomain/mark/1.0/"" target=""_blank"" rel=""noreferrer noopener"">https://creativecommons.org/publicdomain/mark/1.0/</a>",,PDF,,,CCR001_005_143,,,,,,,,,,,,,,,,,,,,,,,,,,,,,,,,,,,,,,,,,,,"Green,Hensley",https://omeka.lib.jmu.edu/erp/files/original/Rockingham_County_Criminal_Court_Criminal_Cases/ccr001_005_143-commonwealth-v-wade-green.pdf,Text,"Rockingham County Criminal Court: Criminal Cases",1,1
6443,https://omeka.lib.jmu.edu/erp/items/show/6443,,,,,,,,,,,,,,,,,,,,,,,,,,,,,,,,,,,,,,,,,"Commonwealth v. Wade H. Sites",Felony^^Theft,"Defendant charged with felony theft.","Rockingham County Criminal Court",,"JMU Libraries",1906,"Jennifer Taylor","This work has been identified as being free of known restrictions under copyright law, including all related and neighboring rights.<br /><a href=""https://creativecommons.org/publicdomain/mark/1.0/"" target=""_blank"" rel=""noreferrer noopener"">https://creativecommons.org/publicdomain/mark/1.0/</a>",,PDF,,,CCR001_004_083,,,,,,,,,,,,,,,,,,,,,,,,,,,,,,,,,,,,,,,,,,,"Henton,Sites",https://omeka.lib.jmu.edu/erp/files/original/Rockingham_County_Criminal_Court_Criminal_Cases/ccr001_004_083-commonwealth-v-wade-h-sites.pdf,Text,"Rockingham County Criminal Court: Criminal Cases",1,1
6442,https://omeka.lib.jmu.edu/erp/items/show/6442,,,,,,,,,,,,,,,,,,,,,,,,,,,,,,,,,,,,,,,,,"Commonwealth v. Wade Wood",Felony^^Rape,"Defendant charged with felony rape.","Rockingham County Criminal Court",,"JMU Libraries",1907,"Jennifer Taylor","This work has been identified as being free of known restrictions under copyright law, including all related and neighboring rights.<br /><a href=""https://creativecommons.org/publicdomain/mark/1.0/"" target=""_blank"" rel=""noreferrer noopener"">https://creativecommons.org/publicdomain/mark/1.0/</a>",,PDF,,,CCR001_004_104,,,,,,,,,,,,,,,,,,,,,,,,,,,,,,,,,,,,,,,,,,,"Griffith,Wood",https://omeka.lib.jmu.edu/erp/files/original/Rockingham_County_Criminal_Court_Criminal_Cases/ccr001_004_104-commonwealth-v-wade-wood.pdf,Text,"Rockingham County Criminal Court: Criminal Cases",1,1
6441,https://omeka.lib.jmu.edu/erp/items/show/6441,,,,,,,,,,,,,,,,,,,,,,,,,,,,,,,,,,,,,,,,,"Commonwealth v. Wallis Lawson",,"Charges unknown","Rockingham County Criminal Court",,"JMU Libraries",1923,"Jennifer Taylor","This work has been identified as being free of known restrictions under copyright law, including all related and neighboring rights.<br /><a href=""https://creativecommons.org/publicdomain/mark/1.0/"" target=""_blank"" rel=""noreferrer noopener"">https://creativecommons.org/publicdomain/mark/1.0/</a>",,PDF,,,CCR001_008_246,,,,,,,,,,,,,,,,,,,,,,,,,,,,,,,,,,,,,,,,,,,Lawson,https://omeka.lib.jmu.edu/erp/files/original/Rockingham_County_Criminal_Court_Criminal_Cases/ccr001_008_246-commonwealth-v-wallis-lawson.pdf,Text,"Rockingham County Criminal Court: Criminal Cases",1,1
6440,https://omeka.lib.jmu.edu/erp/items/show/6440,,,,,,,,,,,,,,,,,,,,,,,,,,,,,,,,,,,,,,,,,"Commonwealth v. Walter Capehart","Misdemeanor^^Sale of Alcohol","Defendant charged with misdemeanor sale of alcohol.","Rockingham County Criminal Court",,"JMU Libraries",1902,"Jennifer Taylor","This work has been identified as being free of known restrictions under copyright law, including all related and neighboring rights.<br /><a href=""https://creativecommons.org/publicdomain/mark/1.0/"" target=""_blank"" rel=""noreferrer noopener"">https://creativecommons.org/publicdomain/mark/1.0/</a>",,PDF,,,CCR001_003_034,,,,,,,,,,,,,,,,,,,,,,,,,,,,,,,,,,,,,,,,,,,"Capehart,Phillips",https://omeka.lib.jmu.edu/erp/files/original/Rockingham_County_Criminal_Court_Criminal_Cases/ccr001_003_034-commonwealth-v-walter-capehart.pdf,Text,"Rockingham County Criminal Court: Criminal Cases",1,1
6439,https://omeka.lib.jmu.edu/erp/items/show/6439,,,,,,,,,,,,,,,,,,,,,,,,,,,,,,,,,,,,,,,,,"Commonwealth v. Walter Cook",Felony^^Rape,"Defendant charged with felony rape.","Rockingham County Criminal Court",,"JMU Libraries",1910,"Jennifer Taylor","This work has been identified as being free of known restrictions under copyright law, including all related and neighboring rights.<br /><a href=""https://creativecommons.org/publicdomain/mark/1.0/"" target=""_blank"" rel=""noreferrer noopener"">https://creativecommons.org/publicdomain/mark/1.0/</a>",,PDF,,,CCR001_006_156,,,,,,,,,,,,,,,,,,,,,,,,,,,,,,,,,,,,,,,,,,,"Cook,Good,Herring",https://omeka.lib.jmu.edu/erp/files/original/Rockingham_County_Criminal_Court_Criminal_Cases/ccr001_006_156-commonwealth-v-walter-cook.pdf,Text,"Rockingham County Criminal Court: Criminal Cases",1,1
6438,https://omeka.lib.jmu.edu/erp/items/show/6438,,,,,,,,,,,,,,,,,,,,,,,,,,,,,,,,,,,,,,,,,"Commonwealth v. Warren Tutwiler",Felony^^Murder,"Defendant charged with felony murder.","Rockingham County Criminal Court",,"JMU Libraries",1924,"Jennifer Taylor","This work has been identified as being free of known restrictions under copyright law, including all related and neighboring rights.<br /><a href=""https://creativecommons.org/publicdomain/mark/1.0/"" target=""_blank"" rel=""noreferrer noopener"">https://creativecommons.org/publicdomain/mark/1.0/</a>",,PDF,,,CCR001_008_266,,,,,,,,,,,,,,,,,,,,,,,,,,,,,,,,,,,,,,,,,,,"Kiser,Tutwiler",https://omeka.lib.jmu.edu/erp/files/original/Rockingham_County_Criminal_Court_Criminal_Cases/ccr001_008_266-commonwealth-v-warren-tutwiler.pdf,Text,"Rockingham County Criminal Court: Criminal Cases",1,1
6437,https://omeka.lib.jmu.edu/erp/items/show/6437,,,,,,,,,,,,,,,,,,,,,,,,,,,,,,,,,,,,,,,,,"Commonwealth v. Welty Minnick",Misdemeanor^^Theft,"Defendant charged with misdemeanor theft.","Rockingham County Criminal Court",,"JMU Libraries",1929,"Jennifer Taylor","This work has been identified as being free of known restrictions under copyright law, including all related and neighboring rights.<br /><a href=""https://creativecommons.org/publicdomain/mark/1.0/"" target=""_blank"" rel=""noreferrer noopener"">https://creativecommons.org/publicdomain/mark/1.0/</a>",,PDF,,,CCR001_010_317,,,,,,,,,,,,,,,,,,,,,,,,,,,,,,,,,,,,,,,,,,,Minnick,https://omeka.lib.jmu.edu/erp/files/original/Rockingham_County_Criminal_Court_Criminal_Cases/ccr001_010_317-commonwealth-v-welty-minnick.pdf,Text,"Rockingham County Criminal Court: Criminal Cases",1,1
6436,https://omeka.lib.jmu.edu/erp/items/show/6436,,,,,,,,,,,,,,,,,,,,,,,,,,,,,,,,,,,,,,,,,"Commonwealth v. Whit Eaton",Felony^^Larceny,"Defendant charged with felony larceny.","Rockingham County Criminal Court",,"JMU Libraries",1902,"Jennifer Taylor","This work has been identified as being free of known restrictions under copyright law, including all related and neighboring rights.<br /><a href=""https://creativecommons.org/publicdomain/mark/1.0/"" target=""_blank"" rel=""noreferrer noopener"">https://creativecommons.org/publicdomain/mark/1.0/</a>",,PDF,,,CCR001_003_036,,,,,,,,,,,,,,,,,,,,,,,,,,,,,,,,,,,,,,,,,,,"Bowman,Eaton",https://omeka.lib.jmu.edu/erp/files/original/Rockingham_County_Criminal_Court_Criminal_Cases/ccr001_003_036-commonwealth-v-whit-eaton.pdf,Text,"Rockingham County Criminal Court: Criminal Cases",1,1
6435,https://omeka.lib.jmu.edu/erp/items/show/6435,,,,,,,,,,,,,,,,,,,,,,,,,,,,,,,,,,,,,,,,,"Commonwealth v. William and Robert Riggleman","Felony^^Burglary^^Break and Enter^^Larceny","Defendants charged with felony break and enter and felony larceny.","Rockingham County Criminal Court",,"JMU Libraries",1908,"Jennifer Taylor","This work has been identified as being free of known restrictions under copyright law, including all related and neighboring rights.<br /><a href=""https://creativecommons.org/publicdomain/mark/1.0/"" target=""_blank"" rel=""noreferrer noopener"">https://creativecommons.org/publicdomain/mark/1.0/</a>",,PDF,,,CCR001_005_126,,,,,,,,,,,,,,,,,,,,,,,,,,,,,,,,,,,,,,,,,,,"Riggleman,Turner",https://omeka.lib.jmu.edu/erp/files/original/Rockingham_County_Criminal_Court_Criminal_Cases/ccr001_005_126-commonwealth-v-william-and-robert-riggleman.pdf,Text,"Rockingham County Criminal Court: Criminal Cases",1,1
6434,https://omeka.lib.jmu.edu/erp/items/show/6434,,,,,,,,,,,,,,,,,,,,,,,,,,,,,,,,,,,,,,,,,"Commonwealth v. William Baugher",Felony^^Arson,"Defendant charged with felony arson.","Rockingham County Criminal Court",,"JMU Libraries",1908,"Jennifer Taylor","This work has been identified as being free of known restrictions under copyright law, including all related and neighboring rights.<br /><a href=""https://creativecommons.org/publicdomain/mark/1.0/"" target=""_blank"" rel=""noreferrer noopener"">https://creativecommons.org/publicdomain/mark/1.0/</a>",,PDF,,,CCR001_005_107,,,,,,,,,,,,,,,,,,,,,,,,,,,,,,,,,,,,,,,,,,,"Baugher,Hensley",https://omeka.lib.jmu.edu/erp/files/original/Rockingham_County_Criminal_Court_Criminal_Cases/ccr001_005_107-commonwealth-v-william-baugher.pdf,Text,"Rockingham County Criminal Court: Criminal Cases",1,1
6433,https://omeka.lib.jmu.edu/erp/items/show/6433,,,,,,,,,,,,,,,,,,,,,,,,,,,,,,,,,,,,,,,,,"Commonwealth v. William Bowman","Misdemeanor^^Sale of Alcohol","Defendant charged with misdemeanor sale of alcohol.","Rockingham County Criminal Court",,"JMU Libraries",1908,"Jennifer Taylor","This work has been identified as being free of known restrictions under copyright law, including all related and neighboring rights.<br /><a href=""https://creativecommons.org/publicdomain/mark/1.0/"" target=""_blank"" rel=""noreferrer noopener"">https://creativecommons.org/publicdomain/mark/1.0/</a>",,PDF,,,CCR001_005_109,,,,,,,,,,,,,,,,,,,,,,,,,,,,,,,,,,,,,,,,,,,Bowman,https://omeka.lib.jmu.edu/erp/files/original/Rockingham_County_Criminal_Court_Criminal_Cases/ccr001_005_109-commonwealth-v-william-bowman.pdf,Text,"Rockingham County Criminal Court: Criminal Cases",1,1
6432,https://omeka.lib.jmu.edu/erp/items/show/6432,,,,,,,,,,,,,,,,,,,,,,,,,,,,,,,,,,,,,,,,,"Commonwealth v. William C. Carter",Felony^^Bigamy^^Bigamy,"Defendant charged with felony bigamy.","Rockingham County Criminal Court",,"JMU Libraries",1930,"Jennifer Taylor","This work has been identified as being free of known restrictions under copyright law, including all related and neighboring rights.<br /><a href=""https://creativecommons.org/publicdomain/mark/1.0/"" target=""_blank"" rel=""noreferrer noopener"">https://creativecommons.org/publicdomain/mark/1.0/</a>",,PDF,,,CCR001_010_319,,,,,,,,,,,,,,,,,,,,,,,,,,,,,,,,,,,,,,,,,,,"Carter,Shifflett",https://omeka.lib.jmu.edu/erp/files/original/Rockingham_County_Criminal_Court_Criminal_Cases/ccr001_010_319-commonwealth-v-william-c-carter.pdf,Text,"Rockingham County Criminal Court: Criminal Cases",1,1
6431,https://omeka.lib.jmu.edu/erp/items/show/6431,,,,,,,,,,,,,,,,,,,,,,,,,,,,,,,,,,,,,,,,,"Commonwealth v. William Dorman","Felony^^Burglary^^Break and Enter^^Larceny","Defendant charged with felony break and enter and felony larceny.","Rockingham County Criminal Court",,"JMU Libraries",1911,"Jennifer Taylor","This work has been identified as being free of known restrictions under copyright law, including all related and neighboring rights.<br /><a href=""https://creativecommons.org/publicdomain/mark/1.0/"" target=""_blank"" rel=""noreferrer noopener"">https://creativecommons.org/publicdomain/mark/1.0/</a>",,PDF,,,CCR001_006_173,,,,,,,,,,,,,,,,,,,,,,,,,,,,,,,,,,,,,,,,,,,"Dorman,Snell",https://omeka.lib.jmu.edu/erp/files/original/Rockingham_County_Criminal_Court_Criminal_Cases/ccr001_006_173-commonwealth-v-william-dorman.pdf,Text,"Rockingham County Criminal Court: Criminal Cases",1,1
6430,https://omeka.lib.jmu.edu/erp/items/show/6430,,,,,,,,,,,,,,,,,,,,,,,,,,,,,,,,,,,,,,,,,"Commonwealth v. William E. Holsinger",Felony^^Theft^^Fraud,"Defendant charged with felony theft and felony fraud.","Rockingham County Criminal Court",,"JMU Libraries",1911,"Jennifer Taylor","This work has been identified as being free of known restrictions under copyright law, including all related and neighboring rights.<br /><a href=""https://creativecommons.org/publicdomain/mark/1.0/"" target=""_blank"" rel=""noreferrer noopener"">https://creativecommons.org/publicdomain/mark/1.0/</a>",,PDF,,,CCR001_006_178,,,,,,,,,,,,,,,,,,,,,,,,,,,,,,,,,,,,,,,,,,,"Holsinger,Welch",https://omeka.lib.jmu.edu/erp/files/original/Rockingham_County_Criminal_Court_Criminal_Cases/ccr001_006_178-commonwealth-v-william-e-holsinger.pdf,Text,"Rockingham County Criminal Court: Criminal Cases",1,1
6429,https://omeka.lib.jmu.edu/erp/items/show/6429,,,,,,,,,,,,,,,,,,,,,,,,,,,,,,,,,,,,,,,,,"Commonwealth v. William J. Ford and Charles Runion",,"Charges unknown","Rockingham County Criminal Court",,"JMU Libraries",1925,"Jennifer Taylor","This work has been identified as being free of known restrictions under copyright law, including all related and neighboring rights.<br /><a href=""https://creativecommons.org/publicdomain/mark/1.0/"" target=""_blank"" rel=""noreferrer noopener"">https://creativecommons.org/publicdomain/mark/1.0/</a>",,PDF,,,CCR001_009_273,,,,,,,,,,,,,,,,,,,,,,,,,,,,,,,,,,,,,,,,,,,"Ford,Runion",https://omeka.lib.jmu.edu/erp/files/original/Rockingham_County_Criminal_Court_Criminal_Cases/ccr001_009_273-commonwealth-v-wm-ford-and-charles-runion.pdf,Text,"Rockingham County Criminal Court: Criminal Cases",1,1
6428,https://omeka.lib.jmu.edu/erp/items/show/6428,,,,,,,,,,,,,,,,,,,,,,,,,,,,,,,,,,,,,,,,,"Commonwealth v. William L. Hammer",Felony^^Bigamy^^Bigamy,"Defendant charged with felony bigamy.","Rockingham County Criminal Court",,"JMU Libraries",1905,"Jennifer Taylor","This work has been identified as being free of known restrictions under copyright law, including all related and neighboring rights.<br /><a href=""https://creativecommons.org/publicdomain/mark/1.0/"" target=""_blank"" rel=""noreferrer noopener"">https://creativecommons.org/publicdomain/mark/1.0/</a>",,PDF,,,CCR001_004_054,,,,,,,,,,,,,,,,,,,,,,,,,,,,,,,,,,,,,,,,,,,"Hammer,Meadows,Merrica",https://omeka.lib.jmu.edu/erp/files/original/Rockingham_County_Criminal_Court_Criminal_Cases/ccr001_004_054-commonwealth-v-william-l-hammer.pdf,Text,"Rockingham County Criminal Court: Criminal Cases",1,1
6427,https://omeka.lib.jmu.edu/erp/items/show/6427,,,,,,,,,,,,,,,,,,,,,,,,,,,,,,,,,,,,,,,,,"Commonwealth v. William L. Sheets","Felony^^Attempted Murder","Defendant charged with felony attempted murder.","Rockingham County Criminal Court",,"JMU Libraries",1906,"Jennifer Taylor","This work has been identified as being free of known restrictions under copyright law, including all related and neighboring rights.<br /><a href=""https://creativecommons.org/publicdomain/mark/1.0/"" target=""_blank"" rel=""noreferrer noopener"">https://creativecommons.org/publicdomain/mark/1.0/</a>",,PDF,,,CCR001_004_080,,,,,,,,,,,,,,,,,,,,,,,,,,,,,,,,,,,,,,,,,,,"Armentrout,Sheets",https://omeka.lib.jmu.edu/erp/files/original/Rockingham_County_Criminal_Court_Criminal_Cases/ccr001_004_080-commonwealth-v-william-l-sheets.pdf,Text,"Rockingham County Criminal Court: Criminal Cases",1,1
6426,https://omeka.lib.jmu.edu/erp/items/show/6426,,,,,,,,,,,,,,,,,,,,,,,,,,,,,,,,,,,,,,,,,"Commonwealth v. William Runion",Felony^^Arson,"Defendant charged with felony arson.","Rockingham County Criminal Court",,"JMU Libraries",1911,"Jennifer Taylor","This work has been identified as being free of known restrictions under copyright law, including all related and neighboring rights.<br /><a href=""https://creativecommons.org/publicdomain/mark/1.0/"" target=""_blank"" rel=""noreferrer noopener"">https://creativecommons.org/publicdomain/mark/1.0/</a>",,PDF,,,CCR001_006_185,,,,,,,,,,,,,,,,,,,,,,,,,,,,,,,,,,,,,,,,,,,Runion,https://omeka.lib.jmu.edu/erp/files/original/Rockingham_County_Criminal_Court_Criminal_Cases/ccr001_006_185-commonwealth-v-william-runion.pdf,Text,"Rockingham County Criminal Court: Criminal Cases",1,1
6425,https://omeka.lib.jmu.edu/erp/items/show/6425,,,,,,,,,,,,,,,,,,,,,,,,,,,,,,,,,,,,,,,,,"Commonwealth v. William Southwick","Felony^^Attempted Murder","Defendant charged with felony attempted murder.","Rockingham County Criminal Court",,"JMU Libraries",1905,"Jennifer Taylor","This work has been identified as being free of known restrictions under copyright law, including all related and neighboring rights.<br /><a href=""https://creativecommons.org/publicdomain/mark/1.0/"" target=""_blank"" rel=""noreferrer noopener"">https://creativecommons.org/publicdomain/mark/1.0/</a>",,PDF,,,CCR001_004_060,,,,,,,,,,,,,,,,,,,,,,,,,,,,,,,,,,,,,,,,,,,"McQuillen,Southwick",https://omeka.lib.jmu.edu/erp/files/original/Rockingham_County_Criminal_Court_Criminal_Cases/ccr001_004_060-commonwealth-v-william-southwick.pdf,Text,"Rockingham County Criminal Court: Criminal Cases",1,1
