﻿"Item Id","Item URI","Dublin Core:Alternative Title","Dublin Core:Abstract","Dublin Core:Table Of Contents","Dublin Core:Date Available","Dublin Core:Date Created","Dublin Core:Date Accepted","Dublin Core:Date Copyrighted","Dublin Core:Date Submitted","Dublin Core:Date Issued","Dublin Core:Date Modified","Dublin Core:Date Valid","Dublin Core:Access Rights","Dublin Core:License","Dublin Core:Conforms To","Dublin Core:Has Format","Dublin Core:Has Part","Dublin Core:Has Version","Dublin Core:Is Format Of","Dublin Core:Is Part Of","Dublin Core:Is Referenced By","Dublin Core:Is Replaced By","Dublin Core:Is Required By","Dublin Core:Is Version Of","Dublin Core:References","Dublin Core:Replaces","Dublin Core:Requires","Dublin Core:Extent","Dublin Core:Medium","Dublin Core:Bibliographic Citation","Dublin Core:Spatial Coverage","Dublin Core:Temporal Coverage","Dublin Core:Accrual Method","Dublin Core:Accrual Periodicity","Dublin Core:Accrual Policy","Dublin Core:Audience","Dublin Core:Audience Education Level","Dublin Core:Mediator","Dublin Core:Instructional Method","Dublin Core:Provenance","Dublin Core:Rights Holder","Dublin Core:Title","Dublin Core:Subject","Dublin Core:Description","Dublin Core:Creator","Dublin Core:Source","Dublin Core:Publisher","Dublin Core:Date","Dublin Core:Contributor","Dublin Core:Rights","Dublin Core:Relation","Dublin Core:Format","Dublin Core:Language","Dublin Core:Type","Dublin Core:Identifier","Dublin Core:Coverage","Item Type Metadata:Text","Item Type Metadata:Interviewer","Item Type Metadata:Interviewee","Item Type Metadata:Location","Item Type Metadata:Transcription","Item Type Metadata:Local URL","Item Type Metadata:Original Format","Item Type Metadata:Physical Dimensions","Item Type Metadata:Duration","Item Type Metadata:Compression","Item Type Metadata:Producer","Item Type Metadata:Director","Item Type Metadata:Bit Rate/Frequency","Item Type Metadata:Time Summary","Item Type Metadata:Email Body","Item Type Metadata:Subject Line","Item Type Metadata:From","Item Type Metadata:To","Item Type Metadata:CC","Item Type Metadata:BCC","Item Type Metadata:Number of Attachments","Item Type Metadata:Standards","Item Type Metadata:Objectives","Item Type Metadata:Materials","Item Type Metadata:Lesson Plan Text","Item Type Metadata:URL","Item Type Metadata:Event Type","Item Type Metadata:Participants","Item Type Metadata:Birth Date","Item Type Metadata:Birthplace","Item Type Metadata:Death Date","Item Type Metadata:Occupation","Item Type Metadata:Biographical Text","Item Type Metadata:Bibliography","Item Type Metadata:Player","Item Type Metadata:Episode","Item Type Metadata:Season","Item Type Metadata:Episode Type","Item Type Metadata:Explicit","Item Type Metadata:Block","PDF Text:Text",tags,file,itemType,collection,public,featured
13635,https://omeka.lib.jmu.edu/erp/items/show/13635,,,,,,,,,,,,,,,,,,,,,,,,,,,,,,,,,,,,,,,,,"Commonwealth v. Patrick Kannality","Assault and Battery","Defendant charged with assault and battery. ","Rockingham County Circuit Court",,"JMU Libraries",1828,"Sydney Ring^^MeganPullen","This work has been identified as being free of known restrictions under copyright law, including all related and neighboring rights. https://creativecommons.org/publicdomain/mark/1.0/",,PDF,,Criminal,Ccr002_009_058,,,,,,,,,,,,,,,,,,,,,,,,,,,,,,,,,,,,,,,,,,,Kannality,https://omeka.lib.jmu.edu/erp/files/original/Rockingham_County_Criminal_Court_Criminal_Cases/Ccr002_009_058.pdf,Text,"Rockingham County Criminal Court: Criminal Cases",1,0
8369,https://omeka.lib.jmu.edu/erp/items/show/8369,,,,,,,,,,,,,,,,,,,,,,,,,,,,,,,,,,,,,,,,,"Commonwealth v. Paul Curtley and Marshall Lourum","Felony^^Assault and Battery","Defendant charged with felony assault and battery. ",,,"JMU LIbraries",1895,"Jennifer Taylor","This work has been identified as being free of known restrictions under copyright law, including all related and neighboring rights.<br /><a href=""https://creativecommons.org/publicdomain/mark/1.0/"" target=""_blank"" rel=""noreferrer noopener"">https://creativecommons.org/publicdomain/mark/1.0/</a>",,PDF,,,CCR001_002_022,,,,,,,,,,,,,,,,,,,,,,,,,,,,,,,,,,,,,,,,,,,"Burke,Curtley,Lourum",https://omeka.lib.jmu.edu/erp/files/original/Rockingham_County_Criminal_Court_Criminal_Cases/ccr001_002_022-commonwealth-v-paul-curtley-marshall-lourum.pdf,Text,"Rockingham County Criminal Court: Criminal Cases",1,0
2952,https://omeka.lib.jmu.edu/erp/items/show/2952,,,,,,,,,,,,,,,,,,,,,,,,,,,,,,,,,,,,,,,,,"Commonwealth v. Paul Grandles",Misdemeanor^^Indictment,"Misdemeanor; Indictment",,"Rockingham County Circuit Court ","JMU Libraries",1924,"Craig Schaefer, Kayla Heslin, Selena St. Andre","This work has been identified as being free of known restrictions under copyright law, including all related and neighboring rights. (<a href=""https://creativecommons.org/publicdomain/mark/1.0/"" target=""_blank"" rel=""noreferrer noopener"">https://creativecommons.org/publicdomain/mark/1.0/</a>)",,PDF,,,RcPr-box4-013,,,,,,,,,,,,,,,,,,,,,,,,,,,,,,,,,,,,,,,,,,,Grandles,https://omeka.lib.jmu.edu/erp/files/original/b0489a89d637d0312a8bd90d73abdf52.pdf,Text,"Rockingham County Prohibition Records: Criminal Cases",1,0
3082,https://omeka.lib.jmu.edu/erp/items/show/3082,,,,,,,,,,,,,,,,,,,,,,,,,,,,,,,,,,,,,,,,,"Commonwealth v. Paul Harris","Felony^^guilty^^manufactured ardent spirits","Felony; Guilty",,"Rockingham County Circuit Court ","JMU Libraries",1927,"Craig Schaefer, Kayla Heslin, Selena St. Andre","This work has been identified as being free of known restrictions under copyright law, including all related and neighboring rights. (<a href=""https://creativecommons.org/publicdomain/mark/1.0/"" target=""_blank"" rel=""noreferrer noopener"">https://creativecommons.org/publicdomain/mark/1.0/</a>)",,"PDF ",,,RcPr-box6-028,,,,,,,,,,,,,,,,,,,,,,,,,,,,,,,,,,,,,,,,,,,Harris,https://omeka.lib.jmu.edu/erp/files/original/29698ef6d20e550f4ef8d0c24413218c.pdf,Text,"Rockingham County Prohibition Records: Criminal Cases",1,0
6496,https://omeka.lib.jmu.edu/erp/items/show/6496,,,,,,,,,,,,,,,,,,,,,,,,,,,,,,,,,,,,,,,,,"Commonwealth v. Paul Lamb",Felony^^Murder,"Defendant charged with felony murder.","Rockingham County Criminal Court",,"JMU Libraries",1919,"Jennifer Taylor","This work has been identified as being free of known restrictions under copyright law, including all related and neighboring rights.<br /><a href=""https://creativecommons.org/publicdomain/mark/1.0/"" target=""_blank"" rel=""noreferrer noopener"">https://creativecommons.org/publicdomain/mark/1.0/</a>",,PDF,,,CCR001_007_215,,,,,,,,,,,,,,,,,,,,,,,,,,,,,,,,,,,,,,,,,,,Lamb,https://omeka.lib.jmu.edu/erp/files/original/Rockingham_County_Criminal_Court_Criminal_Cases/ccr001_007_215-commonwealth-v-paul-lamb.pdf,Text,"Rockingham County Criminal Court: Criminal Cases",1,1
6495,https://omeka.lib.jmu.edu/erp/items/show/6495,,,,,,,,,,,,,,,,,,,,,,,,,,,,,,,,,,,,,,,,,"Commonwealth v. Paul Piner and Coldie Arey","Misdemeanor^^Violate Game Law","Defendants charged with misdemeanor violate game law.","Rockingham County Criminal Court",,"JMU Libraries",1924,"Jennifer Taylor","This work has been identified as being free of known restrictions under copyright law, including all related and neighboring rights.<br /><a href=""https://creativecommons.org/publicdomain/mark/1.0/"" target=""_blank"" rel=""noreferrer noopener"">https://creativecommons.org/publicdomain/mark/1.0/</a>",,PDF,,,CCR001_008_260,,,,,,,,,,,,,,,,,,,,,,,,,,,,,,,,,,,,,,,,,,,"Arey,Piner",https://omeka.lib.jmu.edu/erp/files/original/Rockingham_County_Criminal_Court_Criminal_Cases/ccr001_008_260-commonwealth-v-paul-piner-and-coldie-arey.pdf,Text,"Rockingham County Criminal Court: Criminal Cases",1,1
6494,https://omeka.lib.jmu.edu/erp/items/show/6494,,,,,,,,,,,,,,,,,,,,,,,,,,,,,,,,,,,,,,,,,"Commonwealth v. Paul Rinehart","Misdemeanor^^Sale of Diseased Meat","Defendant charged with misdemeanor sale of diseased meat.","Rockingham County Criminal Court",,"JMU Libraries",1902,"Jennifer Taylor","This work has been identified as being free of known restrictions under copyright law, including all related and neighboring rights.<br /><a href=""https://creativecommons.org/publicdomain/mark/1.0/"" target=""_blank"" rel=""noreferrer noopener"">https://creativecommons.org/publicdomain/mark/1.0/</a>",,PDF,,,CCR001_003_038,,,,,,,,,,,,,,,,,,,,,,,,,,,,,,,,,,,,,,,,,,,"Jordan,Rinehart",https://omeka.lib.jmu.edu/erp/files/original/Rockingham_County_Criminal_Court_Criminal_Cases/ccr001_003_038-commonwealth-v-paul-rinehart.pdf,Text,"Rockingham County Criminal Court: Criminal Cases",1,1
13756,https://omeka.lib.jmu.edu/erp/items/show/13756,,,,,,,,,,,,,,,,,,,,,,,,,,,,,,,,,,,,,,,,,"Commonwealth v. Paul Roller",Felony^^Theft,"Defendant charged with feloniously killing and stealing a heifer. ","Rockingham County Circuit Court",,"JMU Libraries",1837,"Annette Guild^^Sydney Ring^^Megan Pullen","This work has been identified as being free of known restrictions under copyright law, including all related and neighboring rights. https://creativecommons.org/publicdomain/mark/1.0/",,PDF,,Criminal,Ccr002_011_032,,,,,,,,,,,,,,,,,,,,,,,,,,,,,,,,,,,,,,,,,,,Roller,https://omeka.lib.jmu.edu/erp/files/original/Rockingham_County_Criminal_Court_Criminal_Cases/Ccr002_011_032.pdf,Text,"Rockingham County Criminal Court: Criminal Cases",1,0
13703,https://omeka.lib.jmu.edu/erp/items/show/13703,,,,,,,,,,,,,,,,,,,,,,,,,,,,,,,,,,,,,,,,,"Commonwealth v. Paul Rupert","Sell Alcohol","Defendant charged with selling and retailing wine, brandy, rum, ardent spirits without license.","Rockingham County Circuit Court",,"JMU Libraries",1832,"Annette Guild^^Sydney Ring^^Megan Pullen","This work has been identified as being free of known restrictions under copyright law, including all related and neighboring rights. https://creativecommons.org/publicdomain/mark/1.0/",,PDF,,Criminal,Ccr002_010_045,,,,,,,,,,,,,,,,,,,,,,,,,,,,,,,,,,,,,,,,,,,Rupert,https://omeka.lib.jmu.edu/erp/files/original/Rockingham_County_Criminal_Court_Criminal_Cases/Ccr002_010_045.pdf,Text,"Rockingham County Criminal Court: Criminal Cases",1,0
3009,https://omeka.lib.jmu.edu/erp/items/show/3009,,,,,,,,,,,,,,,,,,,,,,,,,,,,,,,,,,,,,,,,,"Commonwealth v. Paull Halterman",Misdemeanor^^guilty,"Misdemeanor; Guilty",,"Rockingham County Circuit Court ","JMU Libraries",1925,"Craig Schaefer, Kayla Heslin, Selena St. Andre","This work has been identified as being free of known restrictions under copyright law, including all related and neighboring rights. (<a href=""https://creativecommons.org/publicdomain/mark/1.0/"" target=""_blank"" rel=""noreferrer noopener"">https://creativecommons.org/publicdomain/mark/1.0/</a>)",,"PDF ",,,RcPr-box5-011,,,,,,,,,,,,,,,,,,,,,,,,,,,,,,,,,,,,,,,,,,,Halterman,https://omeka.lib.jmu.edu/erp/files/original/90385c22e43c0e45853e28d343d468e0.pdf,Text,"Rockingham County Prohibition Records: Criminal Cases",1,0
6493,https://omeka.lib.jmu.edu/erp/items/show/6493,,,,,,,,,,,,,,,,,,,,,,,,,,,,,,,,,,,,,,,,,"Commonwealth v. Paxton Martz and Lurty Holinger",Felony^^Abduction^^Abduction,"Defendants charged with felony abduction.","Rockingham County Criminal Court",,"JMU Libraries",1928,"Jennifer Taylor","This work has been identified as being free of known restrictions under copyright law, including all related and neighboring rights.<br /><a href=""https://creativecommons.org/publicdomain/mark/1.0/"" target=""_blank"" rel=""noreferrer noopener"">https://creativecommons.org/publicdomain/mark/1.0/</a>",,PDF,,,CCR001_010_307,,,,,,,,,,,,,,,,,,,,,,,,,,,,,,,,,,,,,,,,,,,"Holinger,Martz,Simmers",https://omeka.lib.jmu.edu/erp/files/original/Rockingham_County_Criminal_Court_Criminal_Cases/ccr001_010_307-commonwealth-v-p-martz-and-l-holinger.pdf,Text,"Rockingham County Criminal Court: Criminal Cases",1,1
3157,https://omeka.lib.jmu.edu/erp/items/show/3157,,,,,,,,,,,,,,,,,,,,,,,,,,,,,,,,,,,,,,,,,"Commonwealth v. Percy Pirkey","Felony^^guilty^^Provided ardent spirits to a minor","Felony; Guilty",,"Rockingham County Circuit Court ","JMU Libraries",1928,"Craig Schaefer, Kayla Heslin, Selena St. Andre","This work has been identified as being free of known restrictions under copyright law, including all related and neighboring rights. (<a href=""https://creativecommons.org/publicdomain/mark/1.0/"" target=""_blank"" rel=""noreferrer noopener"">https://creativecommons.org/publicdomain/mark/1.0/</a>)",,"PDF ",,,RcPr-box7-048,,,,,,,,,,,,,,,,,,,,,,,,,,,,,,,,,,,,,,,,,,,Pirkey,https://omeka.lib.jmu.edu/erp/files/original/bfa5e35af3a328e58d5dac79dbf6c07e.pdf,Text,"Rockingham County Prohibition Records: Criminal Cases",1,0
3340,https://omeka.lib.jmu.edu/erp/items/show/3340,,,,,,,,,,,,,,,,,,,,,,,,,,,,,,,,,,,,,,,,,"Commonwealth v. Perry Good","Misdemeanor^^guilty^^posession of ardent spiirts- beer","Misdemeanor; Guilty",,"Rockingham County Circuit Court ","JMU Libraries",1932,"Craig Schaefer, Kayla Heslin, Selena St. Andre","This work has been identified as being free of known restrictions under copyright law, including all related and neighboring rights. (<a href=""https://creativecommons.org/publicdomain/mark/1.0/"" target=""_blank"" rel=""noreferrer noopener"">https://creativecommons.org/publicdomain/mark/1.0/</a>)",,"PDF ",,,RcPr-box9-066,,,,,,,,,,,,,,,,,,,,,,,,,,,,,,,,,,,,,,,,,,,Good,https://omeka.lib.jmu.edu/erp/files/original/c2364a26ef19a4e0b153a070969def97.pdf,Text,"Rockingham County Prohibition Records: Criminal Cases",1,0
2990,https://omeka.lib.jmu.edu/erp/items/show/2990,,,,,,,,,,,,,,,,,,,,,,,,,,,,,,,,,,,,,,,,,"Commonwealth v. Perry Smith",Misdemeanor^^Indictment,"Misdemeanor; Indictment",,"Rockingham County Circuit Court ","JMU Libraries",1924,"Craig Schaefer, Kayla Heslin, Selena St. Andre","This work has been identified as being free of known restrictions under copyright law, including all related and neighboring rights. (<a href=""https://creativecommons.org/publicdomain/mark/1.0/"" target=""_blank"" rel=""noreferrer noopener"">https://creativecommons.org/publicdomain/mark/1.0/</a>)",,PDF,,,RcPr-box4-051,,,,,,,,,,,,,,,,,,,,,,,,,,,,,,,,,,,,,,,,,,,Smith,https://omeka.lib.jmu.edu/erp/files/original/44289b8a5f18e92d2519b75825355a88.pdf,Text,"Rockingham County Prohibition Records: Criminal Cases",1,0
3167,https://omeka.lib.jmu.edu/erp/items/show/3167,,,,,,,,,,,,,,,,,,,,,,,,,,,,,,,,,,,,,,,,,"Commonwealth v. Perry Smith","Felony^^Indictment^^Posession of still^^letter (suggests officers look down on multiple offences)","Felony; Indictment",,"Rockingham County Circuit Court ","JMU Libraries",1928,"Craig Schaefer, Kayla Heslin, Selena St. Andre","This work has been identified as being free of known restrictions under copyright law, including all related and neighboring rights. (<a href=""https://creativecommons.org/publicdomain/mark/1.0/"" target=""_blank"" rel=""noreferrer noopener"">https://creativecommons.org/publicdomain/mark/1.0/</a>)",,"PDF ",,,RcPr-box7-058,,,,,,,,,,,,,,,,,,,,,,,,,,,,,,,,,,,,,,,,,,,Smith,https://omeka.lib.jmu.edu/erp/files/original/4b225e182760aee6e50baebed6c2fb01.pdf,Text,"Rockingham County Prohibition Records: Criminal Cases",1,0
6492,https://omeka.lib.jmu.edu/erp/items/show/6492,,,,,,,,,,,,,,,,,,,,,,,,,,,,,,,,,,,,,,,,,"Commonwealth v. Pete Jackson","Misdemeanor^^Sale of Alcohol","Defendant charged with misdemeanor sale of alcohol.","Rockingham County Criminal Court",,"JMU Libraries",1911,"Jennifer Taylor","This work has been identified as being free of known restrictions under copyright law, including all related and neighboring rights.<br /><a href=""https://creativecommons.org/publicdomain/mark/1.0/"" target=""_blank"" rel=""noreferrer noopener"">https://creativecommons.org/publicdomain/mark/1.0/</a>",,PDF,,,CCR001_006_181,,,,,,,,,,,,,,,,,,,,,,,,,,,,,,,,,,,,,,,,,,,Jackson,https://omeka.lib.jmu.edu/erp/files/original/Rockingham_County_Criminal_Court_Criminal_Cases/ccr001_006_181-commonwealth-v-pete-jackson.pdf,Text,"Rockingham County Criminal Court: Criminal Cases",1,1
12955,https://omeka.lib.jmu.edu/erp/items/show/12955,,,,,,,,,,,,,,,,,,,,,,,,,,,,,,,,,,,,,,,,,"Commonwealth v. Peter Driver",Non-attendance^^juror,"Defendant charged with non-attendance as juror.","Rockingham County Circuit Court",,"JMU Libraries",1813,"Annette Guild^^Sydney Ring","This work has been identified as being free of known restrictions under copyright law, including all related and neighboring rights. https://creativecommons.org/publicdomain/mark/1.0/",,PDF,,Criminal,Ccr002_003_027,,,,,,,,,,,,,,,,,,,,,,,,,,,,,,,,,,,,,,,,,,,Driver,https://omeka.lib.jmu.edu/erp/files/original/Rockingham_County_Criminal_Court_Criminal_Cases/Ccr002_003_027.pdf,Text,"Rockingham County Criminal Court: Criminal Cases",1,0
13047,https://omeka.lib.jmu.edu/erp/items/show/13047,,,,,,,,,,,,,,,,,,,,,,,,,,,,,,,,,,,,,,,,,"Commonwealth v. Peter Hairs / Haynes Jr.","Assult and Beating","Defendant charged with assault and beating. Not Guilty","Rockingham County Circuit Court",,"JMU Libraries",1816,"Sydney Ring^^Megan Pullen","This work has been identified as being free of known restrictions under copyright law, including all related and neighboring rights. https://creativecommons.org/publicdomain/mark/1.0/",,PDF,,Criminal,Ccr002_004_039,,,,,,,,,,,,,,,,,,,,,,,,,,,,,,,,,,,,,,,,,,,"Hairs,Haynes",https://omeka.lib.jmu.edu/erp/files/original/Rockingham_County_Criminal_Court_Criminal_Cases/Ccr002_004_039.pdf,Text,"Rockingham County Criminal Court: Criminal Cases",1,0
13068,https://omeka.lib.jmu.edu/erp/items/show/13068,,,,,,,,,,,,,,,,,,,,,,,,,,,,,,,,,,,,,,,,,"Commonwealth v. Peter Hinton","Assault and Beating^^Fighting","Defendant charged with fighting with assault and beating. Not Guilty","Rockingham County Circuit Court",,"JMU Libraries",1816,"Sydney Ring^^Megan Pullen","This work has been identified as being free of known restrictions under copyright law, including all related and neighboring rights. https://creativecommons.org/publicdomain/mark/1.0/",,PDF,,Criminal,Ccr002_004_060,,,,,,,,,,,,,,,,,,,,,,,,,,,,,,,,,,,,,,,,,,,Hinton,https://omeka.lib.jmu.edu/erp/files/original/Rockingham_County_Criminal_Court_Criminal_Cases/Ccr002_004_060.pdf,Text,"Rockingham County Criminal Court: Criminal Cases",1,0
12832,https://omeka.lib.jmu.edu/erp/items/show/12832,,,,,,,,,,,,,,,,,,,,,,,,,,,,,,,,,,,,,,,,,"Commonwealth v. Peter Hull",Unknown,"Defendant charged with unknown offense.","Rockingham County Circuit Court",,"JMU Libraries",1810,"Annette Guild^^Sydney Ring","This work has been identified as being free of known restrictions under copyright law, including all related and neighboring rights. https://creativecommons.org/publicdomain/mark/1.0/",,PDF,,Criminal,Ccr002_001_095,,,,,,,,,,,,,,,,,,,,,,,,,,,,,,,,,,,,,,,,,,,Hull,https://omeka.lib.jmu.edu/erp/files/original/Rockingham_County_Criminal_Court_Criminal_Cases/Ccr002_001_095.pdf,Text,"Rockingham County Criminal Court: Criminal Cases",1,0
