﻿"Item Id","Item URI","Dublin Core:Alternative Title","Dublin Core:Abstract","Dublin Core:Table Of Contents","Dublin Core:Date Available","Dublin Core:Date Created","Dublin Core:Date Accepted","Dublin Core:Date Copyrighted","Dublin Core:Date Submitted","Dublin Core:Date Issued","Dublin Core:Date Modified","Dublin Core:Date Valid","Dublin Core:Access Rights","Dublin Core:License","Dublin Core:Conforms To","Dublin Core:Has Format","Dublin Core:Has Part","Dublin Core:Has Version","Dublin Core:Is Format Of","Dublin Core:Is Part Of","Dublin Core:Is Referenced By","Dublin Core:Is Replaced By","Dublin Core:Is Required By","Dublin Core:Is Version Of","Dublin Core:References","Dublin Core:Replaces","Dublin Core:Requires","Dublin Core:Extent","Dublin Core:Medium","Dublin Core:Bibliographic Citation","Dublin Core:Spatial Coverage","Dublin Core:Temporal Coverage","Dublin Core:Accrual Method","Dublin Core:Accrual Periodicity","Dublin Core:Accrual Policy","Dublin Core:Audience","Dublin Core:Audience Education Level","Dublin Core:Mediator","Dublin Core:Instructional Method","Dublin Core:Provenance","Dublin Core:Rights Holder","Dublin Core:Title","Dublin Core:Subject","Dublin Core:Description","Dublin Core:Creator","Dublin Core:Source","Dublin Core:Publisher","Dublin Core:Date","Dublin Core:Contributor","Dublin Core:Rights","Dublin Core:Relation","Dublin Core:Format","Dublin Core:Language","Dublin Core:Type","Dublin Core:Identifier","Dublin Core:Coverage","Item Type Metadata:Text","Item Type Metadata:Interviewer","Item Type Metadata:Interviewee","Item Type Metadata:Location","Item Type Metadata:Transcription","Item Type Metadata:Local URL","Item Type Metadata:Original Format","Item Type Metadata:Physical Dimensions","Item Type Metadata:Duration","Item Type Metadata:Compression","Item Type Metadata:Producer","Item Type Metadata:Director","Item Type Metadata:Bit Rate/Frequency","Item Type Metadata:Time Summary","Item Type Metadata:Email Body","Item Type Metadata:Subject Line","Item Type Metadata:From","Item Type Metadata:To","Item Type Metadata:CC","Item Type Metadata:BCC","Item Type Metadata:Number of Attachments","Item Type Metadata:Standards","Item Type Metadata:Objectives","Item Type Metadata:Materials","Item Type Metadata:Lesson Plan Text","Item Type Metadata:URL","Item Type Metadata:Event Type","Item Type Metadata:Participants","Item Type Metadata:Birth Date","Item Type Metadata:Birthplace","Item Type Metadata:Death Date","Item Type Metadata:Occupation","Item Type Metadata:Biographical Text","Item Type Metadata:Bibliography","Item Type Metadata:Player","Item Type Metadata:OHMS Object","Item Type Metadata:OHMS Object Text","Item Type Metadata:Interview Keyword","Item Type Metadata:Episode","Item Type Metadata:Season","Item Type Metadata:Episode Type","Item Type Metadata:Explicit","Item Type Metadata:Block","PDF Text:Text",tags,file,itemType,collection,public,featured
1250,https://omeka.lib.jmu.edu/simms/items/show/1250,,,,,,,,,,,,,,,,,,,,,,,,,,,,,,,,,,,,,,,,,"Young Person with Sass","Young adult","A photo of a younger person standing outdoors with their arms crossed. There are buildings in the background.",,"Howard Curry","James Madison University Libraries",,,"<a href=""https://creativecommons.org/licenses/by-nc/4.0/"" target=""_blank"" rel=""noreferrer noopener"">CC By-NC 4.0</a>",,"black-and-white photographs",,"Still Image",simms00191,,,,,,,,,,,,,,,,,,,,,,,,,,,,,,,,,,,,,,,,,,,,,,,"https://omeka.lib.jmu.edu/simms/files/original/Celebrating Simms Collection The Story of the Lucy F. Simms School/simms00191-young-person-with-sass.jpg","Still Image","Celebrating Simms Collection: The Story of the Lucy F. Simms School",1,0
1249,https://omeka.lib.jmu.edu/simms/items/show/1249,,,,,,,,,,,,,,,,,,,,,,,,,,,,,,"Harrisonburg (Va.)",,,,,,,,,,,"Young Simms Students on the Steps","Lucy F. Simms School^^Children^^Stairs^^Dresses","A photo of students standing on the steps of the Lucy F. Simms School. Pictured: Charles Byrd, Teresa Mason, Calvin Williams, Jean Brown, Peter Brown, Larry Madden, Fancis Dickerson, Carter Bundy, Pam Howard, Sally Washington, Linda Carter, Emantha Buck, Sally Washington",,"Billo Harper","James Madison University Libraries",,,"<a href=""https://creativecommons.org/licenses/by-nc/4.0/"" target=""_blank"" rel=""noreferrer noopener"">CC By-NC 4.0</a>",,"black-and-white photographs",,"Still Image",simms00371,,,,,,,,,,,,,,,,,,,,,,,,,,,,,,,,,,,,,,,,,,,,,,"Calvin Williams,Carter Bundy,Charles Byrd,Emantha Buck,Fancis Dickerson,Jean Brown,Larry Madden,Linda Carter,Pam Howard,Peter Brown,Sally Washington,Teresa Mason","https://omeka.lib.jmu.edu/simms/files/original/Celebrating Simms Collection The Story of the Lucy F. Simms School/simms00371-young-simms-students-on-the-steps.jpg","Still Image","Celebrating Simms Collection: The Story of the Lucy F. Simms School",1,0
1247,https://omeka.lib.jmu.edu/simms/items/show/1247,,,,,,,,,,,,,,,,,,,,,,,,,,,,,,,,,,,,,,,,,"Young Woman at Prom","Young women^^Dresses^^Corsages","A photo of a young woman in a gown, wearing a corsage, likely attending a dance.",,"Howard Curry","James Madison University Libraries",,,"<a href=""https://creativecommons.org/licenses/by-nc/4.0/"" target=""_blank"" rel=""noreferrer noopener"">CC By-NC 4.0</a>",,"black-and-white photographs",,"Still Image",simms00126,,,,,,,,,,,,,,,,,,,,,,,,,,,,,,,,,,,,,,,,,,,,,,,"https://omeka.lib.jmu.edu/simms/files/original/Celebrating Simms Collection The Story of the Lucy F. Simms School/simms00126-young-woman-at-prom.jpg","Still Image","Celebrating Simms Collection: The Story of the Lucy F. Simms School",1,0
1248,https://omeka.lib.jmu.edu/simms/items/show/1248,,,,,,,,,,,,,,,,,,,,,,,,,,,,,,,,,,,,,,,,,"Young Woman at Prom","Young adults^^Couples^^Dresses^^Suits (Clothing)^^Corsages","A photo of a well-dressed young woman standing in a hallway, in front of a number of other young people in suits and dresses, likely at a school dance.",,"Howard Curry","James Madison University Libraries",,,"<a href=""https://creativecommons.org/licenses/by-nc/4.0/"" target=""_blank"" rel=""noreferrer noopener"">CC By-NC 4.0</a>",,"black-and-white photographs",,"Still Image",simms00209,,,,,,,,,,,,,,,,,,,,,,,,,,,,,,,,,,,,,,,,,,,,,,,"https://omeka.lib.jmu.edu/simms/files/original/Celebrating Simms Collection The Story of the Lucy F. Simms School/simms00209-young-woman-at-prom.jpg","Still Image","Celebrating Simms Collection: The Story of the Lucy F. Simms School",1,0
1246,https://omeka.lib.jmu.edu/simms/items/show/1246,,,,,,,,,,,,,,,,,,,,,,,,,,,,,,,,,,,,,,,,,"Young Woman in a Coat","Young woman^^Coats^^Trees","A photo of a young woman in a skirt and coat posing outdoors in front of trees.",,"Howard Curry","James Madison University Libraries",,,"<a href=""https://creativecommons.org/licenses/by-nc/4.0/"" target=""_blank"" rel=""noreferrer noopener"">CC By-NC 4.0</a>",,"black-and-white photographs",,"Still Image",simms00167,,,,,,,,,,,,,,,,,,,,,,,,,,,,,,,,,,,,,,,,,,,,,,,"https://omeka.lib.jmu.edu/simms/files/original/Celebrating Simms Collection The Story of the Lucy F. Simms School/simms00167-young-woman-in-a-coat.jpg","Still Image","Celebrating Simms Collection: The Story of the Lucy F. Simms School",1,0
1245,https://omeka.lib.jmu.edu/simms/items/show/1245,,,,,,,,,,,,,,,,,,,,,,,,,,,,,,,,,,,,,,,,,"Young Woman in a Professional Dress","Young women^^Building, house","A photograph of a well-dressed young woman wearing a black dress and hat, posing in front of a house.",,"Jennifer Vickers","James Madison University Libraries",,,"<a href=""https://creativecommons.org/licenses/by-nc/4.0/"" target=""_blank"" rel=""noreferrer noopener"">CC By-NC 4.0</a>",,"black-and-white photographs",,"Still Image",simms00049,,,,,,,,,,,,,,,,,,,,,,,,,,,,,,,,,,,,,,,,,,,,,,,"https://omeka.lib.jmu.edu/simms/files/original/Celebrating Simms Collection The Story of the Lucy F. Simms School/simms00049-young-woman-in-a-professional-dress.jpg","Still Image","Celebrating Simms Collection: The Story of the Lucy F. Simms School",1,0
1244,https://omeka.lib.jmu.edu/simms/items/show/1244,,,,,,,,,,,,,,,,,,,,,,,,,,,,,,,,,,,,,,,,,"Young Woman in Stripes","Young woman^^Pants^^Trees^^Handbags","A photo of a young woman, dressed in a striped shirt, pants, and headcovering, poses on a field in front of a small lake.",,"Howard Curry","James Madison University Libraries",,,"<a href=""https://creativecommons.org/licenses/by-nc/4.0/"" target=""_blank"" rel=""noreferrer noopener"">CC By-NC 4.0</a>",,"black-and-white photographs",,"Still Image",simms00189,,,,,,,,,,,,,,,,,,,,,,,,,,,,,,,,,,,,,,,,,,,,,,,"https://omeka.lib.jmu.edu/simms/files/original/Celebrating Simms Collection The Story of the Lucy F. Simms School/simms00189-young-woman-in-stripes.jpg","Still Image","Celebrating Simms Collection: The Story of the Lucy F. Simms School",1,0
1243,https://omeka.lib.jmu.edu/simms/items/show/1243,,,,,,,,,,,,,,,,,,,,,,,,,,,,,,,,,,,,,,,,,"Young Woman Leaning on a Porch","Young women^^Skirts^^Building, house","A photo of a young woman leaning against a porch column. She is looking towards the ground in front of her.",,"Howard Curry","James Madison University Libraries",,,"<a href=""https://creativecommons.org/licenses/by-nc/4.0/"" target=""_blank"" rel=""noreferrer noopener"">CC By-NC 4.0</a>",,"black-and-white photographs",,"Still Image",simms00155,,,,,,,,,,,,,,,,,,,,,,,,,,,,,,,,,,,,,,,,,,,,,,,"https://omeka.lib.jmu.edu/simms/files/original/Celebrating Simms Collection The Story of the Lucy F. Simms School/simms00155-young-woman-leaning-on-a-porch.jpg","Still Image","Celebrating Simms Collection: The Story of the Lucy F. Simms School",1,0
1242,https://omeka.lib.jmu.edu/simms/items/show/1242,,,,,,,,,,,,,,,,,,,,,,,,,,,,,,,,,,,,,,,,,"Young Woman on a Motorcycle","Young woman^^Motorcycles","A photo of a young woman sitting on a motorcycle, twisting to look back at the camera.",,"Howard Curry","James Madison University Libraries",,,"<a href=""https://creativecommons.org/licenses/by-nc/4.0/"" target=""_blank"" rel=""noreferrer noopener"">CC By-NC 4.0</a>",,"black-and-white photographs",,"Still Image",simms00135,,,,,,,,,,,,,,,,,,,,,,,,,,,,,,,,,,,,,,,,,,,,,,,"https://omeka.lib.jmu.edu/simms/files/original/Celebrating Simms Collection The Story of the Lucy F. Simms School/simms00135-young-woman-on-a-motorcycle.jpg","Still Image","Celebrating Simms Collection: The Story of the Lucy F. Simms School",1,0
1241,https://omeka.lib.jmu.edu/simms/items/show/1241,,,,,,,,,,,,,,,,,,,,,,,,,,,,,,,,,,,,,,,,,"Young Woman on a Porch","Young women^^Building, house","A photo of a woman in a sweater and skirt sitting on the steps on the porch of house 160. She is smiling and appears to be holding a book.",,"Howard Curry","James Madison University Libraries",,,"<a href=""https://creativecommons.org/licenses/by-nc/4.0/"" target=""_blank"" rel=""noreferrer noopener"">CC By-NC 4.0</a>",,"black-and-white photographs",,"Still Image",simms00123,,,,,,,,,,,,,,,,,,,,,,,,,,,,,,,,,,,,,,,,,,,,,,,"https://omeka.lib.jmu.edu/simms/files/original/Celebrating Simms Collection The Story of the Lucy F. Simms School/simms00123-young-woman-on-a-porch.jpg","Still Image","Celebrating Simms Collection: The Story of the Lucy F. Simms School",1,0
